{"text_format":"3","workbook":"xlsx","n_sheets":4,"sheets":["निर्देश","Student_Record","ELIGIBLE GIRLS","form"],"not_rendered":{"images":10,"macros":1,"defined_names":4,"comments":1},"read":"whole","date_system":"1900"}

{"sheet":"निर्देश","index":0,"n_rows":33,"n_cols":11,"rows_kept":33,"merged":[[2,2,2,10],[8,1,8,11],[21,1,21,11],[22,2,28,3],[22,4,28,5],[22,6,28,7],[22,8,27,9],[22,10,27,11],[28,10,28,11],[29,0,29,12],[30,2,30,11],[31,2,31,11],[32,2,32,11]]}
[]
[]
[null,null,"महत्वपूर्ण निर्देश "]
[null,"1. जैसे ही आप excle शीट ओपन करते है आपको सबसे पहला कार्य करना है की फॉर्म शीट में जिस सत्र के फॉर्म प्रिन्ट करने है उस सत्र को लिखे (उदाहरण - 2024-25,2022-2023 )"]
[null,"2. यदि आपको खाली फॉर्म का प्रिन्ट लेना है तो सर्च बॉक्स मे कोई भी गलत वैल्यू इनपुट करे (ऐसा SR नंबर जो लाड़ो योजना में न हो ) उसके बाद फॉर्म खाली हो जाएगा उसका प्रिन्ट ले"]
[null,"3. अपनी स्कूल के स्टूडेंट का डाटा शाला दर्पण के डाउनलोड module से डाउनलोड कर student_Record शीट में पेस्ट करे ताकि प्रिन्ट उसी अनुरूप आए "]
[null,"5. यदि आपके पीसी में फाइल काम नहीं कर रही है तो एक बार यह चेक करे  की आपका Developer tab ओपन है या नहीं "]
[null,"6. शीट काम नहीं कर रही है तो उक्त सेटिंग को चेक करे यदि developer tab ओपन नहीं है तो नीचे दिए लिंक से विडिओ देख कर tab ओपन करे"]
[null,"विडिओ देखने के लिए क्लिक करे "]
[null,"7. यदि आपका डेवलपर टैब ओपन है तो नीचे दिए गई सेटिंग को चेक करे यदि फिर भी समस्या बनी रहती है तो हमे मेल करे shivrajmeghwanshibarola567@gmail.com"]
{"$rows_empty":11}
[null,"मार्गदर्शक "]
[null,null," Ahwini Kumar",null,"Mr. Heera Lal Jat",null,"Ram Karan Beniwal"]
[]
[]
[]
[]
[]
[{"$nulls":8},"Mr. Parmanand Meghwal",null,"Mr. Shivraj Meghwanshi"]
["हमारे द्वारा बनाई गई आवश्यक फाइल डॉक्यूमेंट एक्सल फाइल प्राप्त करने के लिए निमन्नालिखित लिंक पर क्लिक करे  "]
[null,{"$f":"_xlfn.UNICHAR(9758)","v":"☞"},"https://rajsevak.com/shivraj-meghwanshi/"]
[null,{"$f":"_xlfn.UNICHAR(9758)","v":"☞"},"https://rajteachers.co/shivraj-meghvanshi"]
[null,"☞","https://www.ashwinisharma.com/p/shivraj-meghwanshi-excel-program-excel.html"]

{"sheet":"Student_Record","index":1,"n_rows":364,"n_cols":30,"rows_kept":364}
["Class","Section","SRNO","DOA","Name","Late Status","FatherName","MotherName","Gender","Dob","ClassRollNo","ExamRollNumber","School Total Working Days","Student Total Attendence","Category","Religion","Previous Year Marks","Name Of School","School UDise Code","Aadhar No of Student","Bhamashash Card","Mobile No Student(Father/Mother/Guardian","Student Permanent Address","Annual Parental Income","CWSN Status","BPL Status","Minority Status","Age On Present(In Years)","Co-Curricular Activity","Distance From School"]
[1,"A",973,"2025-10-03","Anisha Choudhary",null,"Prahlad Choudhary","Tina","F","2017-09-28",null,null,171,103,"OBC",null,null,"GOVT. SENIOR SECONDARY SCHOOL",8210302,null,null,77426475575,"xyz  ajmer ,rajasthan 3333335",null,"N","Y",null,9,null,1]
[1,"A",968,"2025-08-18","Anjali",null,"Sanwaraa","Samotra","F","2018-08-20",null,null,171,133,"OBC","Hindu",null,"GOVT. SENIOR SECONDARY SCHOOL",8210302,null,null,77426475576,"xyz  ajmer ,rajasthan 3333336",55000,"N","N","No",8,"None",0]
[1,"A",970,"2025-09-18","Ankit",null,"Omprakash","Jamna","M","2019-11-17",null,null,171,127,"OBC",null,null,"GOVT. SENIOR SECONDARY SCHOOL",8210302,null,null,77426475577,"xyz  ajmer ,rajasthan 3333337",null,"N","Y",null,7,null,1]
[1,"A",926,"2025-07-09","Arti Prajapat",null,"Mukesh Kumhar","Shrwani","F","2020-05-15",null,null,171,147,"OBC","Hindu",null,"GOVT. SENIOR SECONDARY SCHOOL",8210302,null,null,77426475578,"xyz  ajmer ,rajasthan 3333338",48000,"N","N","No",6,"None",0]
[1,"A",959,"2025-07-30","Dipika Prajapat",null,"Madan Lal Prajapat","Lali Devi","F","2019-03-20",null,null,171,143,"OBC","Hindu",null,"GOVT. SENIOR SECONDARY SCHOOL",8210302,null,null,77426475579,"xyz  ajmer ,rajasthan 3333339",50000,"N","N","No",7,"None",1]
[1,"A",941,"2025-07-16","Jyoti",null,"Mukesh","Maina","F","2019-04-15",null,null,171,143,"OBC","Hindu",null,"GOVT. SENIOR SECONDARY SCHOOL",8210302,null,null,77426475580,"xyz  ajmer ,rajasthan 3333340",48000,"N","N","No",7,"None",1]
[1,"A",924,"2025-07-01","Kismat Choudhary",null,"Jay Prakash Choudhary","Bharti","F","2019-05-01",null,null,171,150,"OBC","Hindu",null,"GOVT. SENIOR SECONDARY SCHOOL",8210302,null,null,77426475581,"xyz  ajmer ,rajasthan 3333341",60000,"N","N","No",7,"None",1]
[1,"A",971,"2025-10-03","Monika Choudhary",null,"Prahlad Jat","Tina","F","2019-08-15",null,null,171,106,"OBC",null,null,"GOVT. SENIOR SECONDARY SCHOOL",8210302,null,null,77426475582,"xyz  ajmer ,rajasthan 3333342",null,"N","Y",null,7,null,1]
[1,"A",951,"2025-07-21","Neeraj Bansali",null,"ranjeet","Pushpa","M","2020-03-22",null,null,171,144,"SC","Hindu",null,"GOVT. SENIOR SECONDARY SCHOOL",8210302,null,null,77426475583,"xyz  ajmer ,rajasthan 3333343",48000,"N","N","No",6,"None",1]
[1,"A",937,"2025-07-14","Payal",null,"Pankaj Kumar","Kanchan","F","2019-08-14",null,null,171,144,"OBC","Hindu",null,"GOVT. SENIOR SECONDARY SCHOOL",8210302,null,null,77426475584,"xyz  ajmer ,rajasthan 3333344",48000,"N","N","No",7,"None",1]
[1,"A",962,"2025-08-14","Riya Nat",null,"Jitendra","Ishu Nat","F","2019-12-09",null,null,171,134,"SC","Hindu",null,"GOVT. SENIOR SECONDARY SCHOOL",8210302,null,null,77426475585,"xyz  ajmer ,rajasthan 3333345",60000,"N","N","No",7,"None",0]
[1,"A",934,"2025-07-14","Tannu Jat",null,"Sardar","Surgyan","F","2017-09-15",null,null,171,126,"OBC","Hindu",null,"GOVT. SENIOR SECONDARY SCHOOL",8210302,null,null,77426475586,"xyz  ajmer ,rajasthan 3333346",48000,"N","N","No",9,"None",1]
[2,"A",907,"2024-07-25","Aarushi",null,"Satyanarayan Jat","Ajodya","F","2019-04-19",null,null,171,149,"OBC","Hindu",null,"GOVT. SENIOR SECONDARY SCHOOL",8210302,"XXXX5052",null,77426475587,"xyz  ajmer ,rajasthan 3333347",0,"N","N","No",7,"None",0]
[2,"A",920,"2024-08-20","Anjali Meghwanshi",null,"Shankar","Gyarsi Meghwanshi","F","2019-03-21",null,null,171,145,"SC","Hindu",null,"GOVT. SENIOR SECONDARY SCHOOL",8210302,"XXXX0328",null,77426475588,"xyz  ajmer ,rajasthan 3333348",60000,"N","N","No",7,"None",0]
[2,"A",906,"2024-07-25","Annu Jat",null,"Ramswaroop","Bhagawati","F","2019-02-11",null,null,171,150,"OBC","Hindu",null,"GOVT. SENIOR SECONDARY SCHOOL",8210302,"XXXX6543",null,77426475589,"xyz  ajmer ,rajasthan 3333349",0,"N","N","No",7,"None",0]
[2,"A",901,"2024-07-19","Bhumika Sain",null,"Rajesh Sain","Lalita Sain","F","2019-03-28",null,null,171,144,"OBC","Hindu",null,"GOVT. SENIOR SECONDARY SCHOOL",8210302,"XXXX8084",null,77426475590,"xyz  ajmer ,rajasthan 3333350",0,"N","N","No",7,"None",0]
[2,"A",885,"2024-07-08","Dinesh Regar",null,"Kalu Ram","Rinku","M","2018-07-06",null,null,171,148,"SC","Hindu",null,"GOVT. SENIOR SECONDARY SCHOOL",8210302,"XXXX8689",null,77426475591,"xyz  ajmer ,rajasthan 3333351",0,"N","N","No",8,"None",0]
[2,"A",914,"2024-07-31","Jagdish Prajapat",null,"Hansraj","Prem","M","2019-08-01",null,null,171,148,"OBC","Hindu",null,"GOVT. SENIOR SECONDARY SCHOOL",8210302,"XXXX9393",null,77426475592,"xyz  ajmer ,rajasthan 3333352",0,"N","N","No",7,"None",0]
[2,"A",877,"2024-07-04","Khushi",null,"Mukesh","Shrwani","F","2018-05-19",null,null,171,143,"OBC","Hindu",null,"GOVT. SENIOR SECONDARY SCHOOL",8210302,"XXXX9543",null,77426475593,"xyz  ajmer ,rajasthan 3333353",55000,"N","N","No",8,"None",0]
[2,"A",922,"2024-09-02","Khushi Jat",null,"Parmeshwar","Shanti","F","2018-08-12",null,null,171,145,"OBC","Hindu",null,"GOVT. SENIOR SECONDARY SCHOOL",8210302,"XXXX6362",null,77426475594,"xyz  ajmer ,rajasthan 3333354",50000,"N","N","No",8,"None",0]
[2,"A",921,"2024-08-20","Lokesh Prajapat",null,"Hardayal","Sona","M","2018-05-15",null,null,171,148,"OBC","Hindu",null,"GOVT. SENIOR SECONDARY SCHOOL",8210302,"XXXX6114",null,77426475595,"xyz  ajmer ,rajasthan 3333355",60000,"N","N","No",8,"None",0]
[2,"A",878,"2024-07-04","Mansha Jat",null,"Prem Chand Jat","Gamla Jat","F","2018-05-13",null,null,171,149,"OBC","Hindu",null,"GOVT. SENIOR SECONDARY SCHOOL",8210302,"XXXX9859",null,77426475596,"xyz  ajmer ,rajasthan 3333356",60000,"N","N","No",8,"None",0]
[2,"A",875,"2024-07-02","Mona",null,"Ramesh Chand","Gita Devi","F","2018-06-11",null,null,171,150,"SC","Hindu",null,"GOVT. SENIOR SECONDARY SCHOOL",8210302,"XXXX2685",null,77426475597,"xyz  ajmer ,rajasthan 3333357",60000,"N","N","No",8,"None",0]
[2,"A",884,"2024-07-06","Monika Prajapat",null,"Prakash","Parvati","F","2018-04-20",null,null,171,146,"OBC","Hindu",null,"GOVT. SENIOR SECONDARY SCHOOL",8210302,"XXXX8935",null,77426475598,"xyz  ajmer ,rajasthan 3333358",0,"N","N","No",8,"None",0]
[2,"A",879,"2024-07-05","Pooja Jat",null,"Shankar","Sharda Devi","F","2018-08-25",null,null,171,148,"OBC","Hindu",null,"GOVT. SENIOR SECONDARY SCHOOL",8210302,"XXXX5942",null,77426475599,"xyz  ajmer ,rajasthan 3333359",0,"N","N","No",8,"None",0]
[2,"A",880,"2024-07-05","Priya Jat",null,"Ganesh","Saroj Devi","F","2017-12-30",null,null,171,148,"OBC","Hindu",null,"GOVT. SENIOR SECONDARY SCHOOL",8210302,"XXXX5265",null,77426475600,"xyz  ajmer ,rajasthan 3333360",0,"N","N","No",9,"None",0]
[2,"A",881,"2024-07-06","Radhika",null,"Dhanraj","Mathra","F","2018-06-01",null,null,171,146,"OBC","Hindu",null,"GOVT. SENIOR SECONDARY SCHOOL",8210302,"XXXX5589",null,77426475601,"xyz  ajmer ,rajasthan 3333361",0,"N","N","No",8,"None",0]
[2,"A",923,"2024-09-02","Rajveer Jat",null,"Prithviraj","Suman Devi","M","2019-11-09",null,null,171,149,"OBC","Hindu",null,"GOVT. SENIOR SECONDARY SCHOOL",8210302,"XXXX6423",null,77426475602,"xyz  ajmer ,rajasthan 3333362",55000,"N","N","No",7,"None",0]
[2,"A",905,"2024-07-19","Rinku Prajapat",null,"Kailash","Parvati","F","2018-11-15",null,null,171,148,"OBC","Hindu",null,"GOVT. SENIOR SECONDARY SCHOOL",8210302,"XXXX8744",null,77426475603,"xyz  ajmer ,rajasthan 3333363",0,"N","N","No",8,"None",0]
{"$rows_left_out":335}
{"sheet":"ELIGIBLE GIRLS","index":2,"n_rows":127,"n_cols":31,"rows_kept":127,"merged":[[0,0,0,10]]}
["मुख्यमंत्री लाडो प्रोत्साहन योजना की पात्र बालिकाओ की सूची "]
["S.NO",{"$f":"Student_Record!A1:AD1","v":"Class"},"Section","SRNO","DOA","Name","Late Status","FatherName","MotherName","Gender","Dob","ClassRollNo","ExamRollNumber","School Total Working Days","Student Total Attendence","Category","Religion","Previous Year Marks","Name Of School","School UDise Code","Aadhar No of Student","Bhamashash Card","Mobile No Student(Father/Mother/Guardian","Student Permanent Address","Annual Parental Income","CWSN Status","BPL Status","Minority Status","Age On Present(In Years)","Co-Curricular Activity","Distance From School"]
[{"$f":"IF(B3<>\"\",COUNTA($A$2:A2),\"\")","v":1},{"$f":"_xlfn.LET(\n  _xlpm.data, _xlfn._xlws.FILTER(Student_Record!A:AD, (Student_Record!J:J>=DATE(2016,6,1)) * (Student_Record!I:I=\"F\")),\n  IF(_xlpm.data=0, \"\", _xlpm.data)\n)","v":1},"A",973,"2025-10-03","Anisha Choudhary","","Prahlad Choudhary","Tina","F","2017-09-28","","",171,103,"OBC","","","GOVT. SENIOR SECONDARY SCHOOL",8210302,"","",77426475575,"xyz  ajmer ,rajasthan 3333335","","N","Y","",9,"",1]
[{"$f":"IF(B4<>\"\",COUNTA($A$2:A3),\"\")","v":2},1,"A",968,"2025-08-18","Anjali","","Sanwaraa","Samotra","F","2018-08-20","","",171,133,"OBC","Hindu","","GOVT. SENIOR SECONDARY SCHOOL",8210302,"","",77426475576,"xyz  ajmer ,rajasthan 3333336",55000,"N","N","No",8,"None",""]
[{"$f":"IF(B5<>\"\",COUNTA($A$2:A4),\"\")","v":3},1,"A",926,"2025-07-09","Arti Prajapat","","Mukesh Kumhar","Shrwani","F","2020-05-15","","",171,147,"OBC","Hindu","","GOVT. SENIOR SECONDARY SCHOOL",8210302,"","",77426475578,"xyz  ajmer ,rajasthan 3333338",48000,"N","N","No",6,"None",""]
[{"$f":"IF(B6<>\"\",COUNTA($A$2:A5),\"\")","v":4},1,"A",959,"2025-07-30","Dipika Prajapat","","Madan Lal Prajapat","Lali Devi","F","2019-03-20","","",171,143,"OBC","Hindu","","GOVT. SENIOR SECONDARY SCHOOL",8210302,"","",77426475579,"xyz  ajmer ,rajasthan 3333339",50000,"N","N","No",7,"None",1]
[{"$f":"IF(B7<>\"\",COUNTA($A$2:A6),\"\")","v":5},1,"A",941,"2025-07-16","Jyoti","","Mukesh","Maina","F","2019-04-15","","",171,143,"OBC","Hindu","","GOVT. SENIOR SECONDARY SCHOOL",8210302,"","",77426475580,"xyz  ajmer ,rajasthan 3333340",48000,"N","N","No",7,"None",1]
[{"$f":"IF(B8<>\"\",COUNTA($A$2:A7),\"\")","v":6},1,"A",924,"2025-07-01","Kismat Choudhary","","Jay Prakash Choudhary","Bharti","F","2019-05-01","","",171,150,"OBC","Hindu","","GOVT. SENIOR SECONDARY SCHOOL",8210302,"","",77426475581,"xyz  ajmer ,rajasthan 3333341",60000,"N","N","No",7,"None",1]
[{"$f":"IF(B9<>\"\",COUNTA($A$2:A8),\"\")","v":7},1,"A",971,"2025-10-03","Monika Choudhary","","Prahlad Jat","Tina","F","2019-08-15","","",171,106,"OBC","","","GOVT. SENIOR SECONDARY SCHOOL",8210302,"","",77426475582,"xyz  ajmer ,rajasthan 3333342","","N","Y","",7,"",1]
[{"$f":"IF(B10<>\"\",COUNTA($A$2:A9),\"\")","v":8},1,"A",937,"2025-07-14","Payal","","Pankaj Kumar","Kanchan","F","2019-08-14","","",171,144,"OBC","Hindu","","GOVT. SENIOR SECONDARY SCHOOL",8210302,"","",77426475584,"xyz  ajmer ,rajasthan 3333344",48000,"N","N","No",7,"None",1]
[{"$f":"IF(B11<>\"\",COUNTA($A$2:A10),\"\")","v":9},1,"A",962,"2025-08-14","Riya Nat","","Jitendra","Ishu Nat","F","2019-12-09","","",171,134,"SC","Hindu","","GOVT. SENIOR SECONDARY SCHOOL",8210302,"","",77426475585,"xyz  ajmer ,rajasthan 3333345",60000,"N","N","No",7,"None",""]
[{"$f":"IF(B12<>\"\",COUNTA($A$2:A11),\"\")","v":10},1,"A",934,"2025-07-14","Tannu Jat","","Sardar","Surgyan","F","2017-09-15","","",171,126,"OBC","Hindu","","GOVT. SENIOR SECONDARY SCHOOL",8210302,"","",77426475586,"xyz  ajmer ,rajasthan 3333346",48000,"N","N","No",9,"None",1]
[{"$f":"IF(B13<>\"\",COUNTA($A$2:A12),\"\")","v":11},2,"A",907,"2024-07-25","Aarushi","","Satyanarayan Jat","Ajodya","F","2019-04-19","","",171,149,"OBC","Hindu","","GOVT. SENIOR SECONDARY SCHOOL",8210302,"XXXX5052","",77426475587,"xyz  ajmer ,rajasthan 3333347","","N","N","No",7,"None",""]
[{"$f":"IF(B14<>\"\",COUNTA($A$2:A13),\"\")","v":12},2,"A",920,"2024-08-20","Anjali Meghwanshi","","Shankar","Gyarsi Meghwanshi","F","2019-03-21","","",171,145,"SC","Hindu","","GOVT. SENIOR SECONDARY SCHOOL",8210302,"XXXX0328","",77426475588,"xyz  ajmer ,rajasthan 3333348",60000,"N","N","No",7,"None",""]
[{"$f":"IF(B15<>\"\",COUNTA($A$2:A14),\"\")","v":13},2,"A",906,"2024-07-25","Annu Jat","","Ramswaroop","Bhagawati","F","2019-02-11","","",171,150,"OBC","Hindu","","GOVT. SENIOR SECONDARY SCHOOL",8210302,"XXXX6543","",77426475589,"xyz  ajmer ,rajasthan 3333349","","N","N","No",7,"None",""]
[{"$f":"IF(B16<>\"\",COUNTA($A$2:A15),\"\")","v":14},2,"A",901,"2024-07-19","Bhumika Sain","","Rajesh Sain","Lalita Sain","F","2019-03-28","","",171,144,"OBC","Hindu","","GOVT. SENIOR SECONDARY SCHOOL",8210302,"XXXX8084","",77426475590,"xyz  ajmer ,rajasthan 3333350","","N","N","No",7,"None",""]
[{"$f":"IF(B17<>\"\",COUNTA($A$2:A16),\"\")","v":15},2,"A",877,"2024-07-04","Khushi","","Mukesh","Shrwani","F","2018-05-19","","",171,143,"OBC","Hindu","","GOVT. SENIOR SECONDARY SCHOOL",8210302,"XXXX9543","",77426475593,"xyz  ajmer ,rajasthan 3333353",55000,"N","N","No",8,"None",""]
[{"$f":"IF(B18<>\"\",COUNTA($A$2:A17),\"\")","v":16},2,"A",922,"2024-09-02","Khushi Jat","","Parmeshwar","Shanti","F","2018-08-12","","",171,145,"OBC","Hindu","","GOVT. SENIOR SECONDARY SCHOOL",8210302,"XXXX6362","",77426475594,"xyz  ajmer ,rajasthan 3333354",50000,"N","N","No",8,"None",""]
[{"$f":"IF(B19<>\"\",COUNTA($A$2:A18),\"\")","v":17},2,"A",878,"2024-07-04","Mansha Jat","","Prem Chand Jat","Gamla Jat","F","2018-05-13","","",171,149,"OBC","Hindu","","GOVT. SENIOR SECONDARY SCHOOL",8210302,"XXXX9859","",77426475596,"xyz  ajmer ,rajasthan 3333356",60000,"N","N","No",8,"None",""]
[{"$f":"IF(B20<>\"\",COUNTA($A$2:A19),\"\")","v":18},2,"A",875,"2024-07-02","Mona","","Ramesh Chand","Gita Devi","F","2018-06-11","","",171,150,"SC","Hindu","","GOVT. SENIOR SECONDARY SCHOOL",8210302,"XXXX2685","",77426475597,"xyz  ajmer ,rajasthan 3333357",60000,"N","N","No",8,"None",""]
[{"$f":"IF(B21<>\"\",COUNTA($A$2:A20),\"\")","v":19},2,"A",884,"2024-07-06","Monika Prajapat","","Prakash","Parvati","F","2018-04-20","","",171,146,"OBC","Hindu","","GOVT. SENIOR SECONDARY SCHOOL",8210302,"XXXX8935","",77426475598,"xyz  ajmer ,rajasthan 3333358","","N","N","No",8,"None",""]
[{"$f":"IF(B22<>\"\",COUNTA($A$2:A21),\"\")","v":20},2,"A",879,"2024-07-05","Pooja Jat","","Shankar","Sharda Devi","F","2018-08-25","","",171,148,"OBC","Hindu","","GOVT. SENIOR SECONDARY SCHOOL",8210302,"XXXX5942","",77426475599,"xyz  ajmer ,rajasthan 3333359","","N","N","No",8,"None",""]
[{"$f":"IF(B23<>\"\",COUNTA($A$2:A22),\"\")","v":21},2,"A",880,"2024-07-05","Priya Jat","","Ganesh","Saroj Devi","F","2017-12-30","","",171,148,"OBC","Hindu","","GOVT. SENIOR SECONDARY SCHOOL",8210302,"XXXX5265","",77426475600,"xyz  ajmer ,rajasthan 3333360","","N","N","No",9,"None",""]
[{"$f":"IF(B24<>\"\",COUNTA($A$2:A23),\"\")","v":22},2,"A",881,"2024-07-06","Radhika","","Dhanraj","Mathra","F","2018-06-01","","",171,146,"OBC","Hindu","","GOVT. SENIOR SECONDARY SCHOOL",8210302,"XXXX5589","",77426475601,"xyz  ajmer ,rajasthan 3333361","","N","N","No",8,"None",""]
[{"$f":"IF(B25<>\"\",COUNTA($A$2:A24),\"\")","v":23},2,"A",905,"2024-07-19","Rinku Prajapat","","Kailash","Parvati","F","2018-11-15","","",171,148,"OBC","Hindu","","GOVT. SENIOR SECONDARY SCHOOL",8210302,"XXXX8744","",77426475603,"xyz  ajmer ,rajasthan 3333363","","N","N","No",8,"None",""]
[{"$f":"IF(B26<>\"\",COUNTA($A$2:A25),\"\")","v":24},2,"A",899,"2024-07-18","Shivangi","","Hanuman","Chaina","F","2017-03-23","","",171,147,"OBC","Hindu","","GOVT. SENIOR SECONDARY SCHOOL",8210302,"XXXX4862","",77426475604,"xyz  ajmer ,rajasthan 3333364","","N","N","No",9,"None",""]
[{"$f":"IF(B27<>\"\",COUNTA($A$2:A26),\"\")","v":25},2,"A",874,"2024-07-02","Shivani","","Prithvi Raj","Suman Devi","F","2018-10-20","","",171,146,"OBC","Hindu","","GOVT. SENIOR SECONDARY SCHOOL",8210302,"XXXX9004","",77426475605,"xyz  ajmer ,rajasthan 3333365",60000,"N","N","No",8,"None",""]
[{"$f":"IF(B28<>\"\",COUNTA($A$2:A27),\"\")","v":26},2,"A",882,"2024-07-06","Tannu","","Basram","Shila","F","2018-06-14","","",171,149,"OBC","Hindu","","GOVT. SENIOR SECONDARY SCHOOL",8210302,"XXXX8326","",77426475606,"xyz  ajmer ,rajasthan 3333366","","N","N","No",8,"None",""]
[{"$f":"IF(B29<>\"\",COUNTA($A$2:A28),\"\")","v":27},3,"A",853,"2023-07-21","Ashika","","Hariram","Lada Devi","F","2017-01-23","","",171,149,"OBC","Hindu","","GOVT. SENIOR SECONDARY SCHOOL",8210302,"XXXX1296","",77426475611,"xyz  ajmer ,rajasthan 3333371","","N","N","No",9,"None",""]
[{"$f":"IF(B30<>\"\",COUNTA($A$2:A29),\"\")","v":28},3,"A",893,"2024-07-15","Bhawana Choudhary","","Mahaveer Prasad Jat","Sita","F","2017-08-31","","",171,150,"OBC","Hindu","","GOVT. SENIOR SECONDARY SCHOOL",8210302,"XXXX5647","",77426475612,"xyz  ajmer ,rajasthan 3333372",50000,"N","N","No",9,"None",""]
{"$rows_left_out":98}
{"sheet":"form","index":3,"n_rows":61,"n_cols":7,"rows_kept":61,"merged":[[0,0,0,4],[0,6,1,8],[1,0,1,4],[2,6,3,8],[3,1,3,3],[3,4,3,5],[4,1,4,3],[5,10,5,12],[6,1,6,3],[6,4,6,5],[6,10,7,13],[7,1,7,3],[7,4,7,5],[8,1,8,3],[8,4,8,5],[8,6,9,8],[9,1,9,3],[9,4,9,5],[10,1,10,3],[10,4,10,5],[10,6,11,9],[11,1,11,3],[11,4,11,5],[12,1,12,3],[12,4,12,5],[13,1,13,3],[13,4,13,5],[14,1,14,3],[14,4,14,5],[15,1,15,3],[15,4,15,5],[16,1,16,3],[16,4,16,5],[17,1,17,3],[17,4,17,5],[18,1,18,3],[18,4,18,5],[19,1,19,3],[19,4,19,5],[20,1,20,3],[20,4,20,5],[21,1,21,3],[21,4,21,5],[23,1,23,5],[24,1,24,4],[25,1,25,4],[26,1,26,4],[27,1,27,4],[28,1,28,4],[29,1,29,4],[33,2,33,3],[37,0,37,5],[38,2,38,5],[39,0,49,5],[50,0,50,5],[53,0,53,5],[54,0,54,1],[54,2,54,3],[55,0,55,5],[56,0,56,3],[57,0,57,5],[60,0,60,5]]}
["शिक्षा विभाग ,राजस्थान सरकार ",{"$nulls":5},"प्रिन्ट करने ले लिए SR.NO या लिस्ट नंबर लिखे "]
["लाडो प्रोत्साहन योजना के लिए आवेदन पत्र वर्ष -",{"$nulls":4},"2026-27"]
[{"$nulls":6},3]
[null,"छात्रा की छात्रवृत्ति यूनिक आई. डी .........................."]
[null,"(पूर्ति संस्था प्रधान द्वारा शालादर्पण पोर्टल से की जाएगी )"]
[]
[1,"विद्यालय का नाम ",null,null,{"$f":"IFERROR(\n   INDEX('ELIGIBLE GIRLS'!S:S, MATCH(G3, 'ELIGIBLE GIRLS'!A:A, 0)),\n   IFERROR(\n      INDEX('ELIGIBLE GIRLS'!S:S, MATCH(G3, 'ELIGIBLE GIRLS'!D:D, 0)),\n      \"\"\n   )\n)","v":"GOVT. SENIOR SECONDARY SCHOOL"}]
[2,"छात्रा का नाम ",null,null,{"$f":"IFERROR(\n   INDEX('ELIGIBLE GIRLS'!F:F, MATCH(G3, 'ELIGIBLE GIRLS'!A:A, 0)),\n   IFERROR(\n      INDEX('ELIGIBLE GIRLS'!F:F, MATCH(G3, 'ELIGIBLE GIRLS'!D:D, 0)),\n      \"\"\n   )\n)","v":"Arti Prajapat"}]
[3,"छात्रा की माता का नाम ",null,null,{"$f":"IFERROR(\n   INDEX('ELIGIBLE GIRLS'!I:I, MATCH(G3, 'ELIGIBLE GIRLS'!A:A, 0)),\n   IFERROR(\n      INDEX('ELIGIBLE GIRLS'!I:I, MATCH(G3, 'ELIGIBLE GIRLS'!D:D, 0)),\n      \"\"\n   )\n)","v":"Shrwani"}]
[4,"छात्रा के पिता का नाम ",null,null,{"$f":"IFERROR(\n   INDEX('ELIGIBLE GIRLS'!H:H, MATCH(G3, 'ELIGIBLE GIRLS'!A:A, 0)),\n   IFERROR(\n      INDEX('ELIGIBLE GIRLS'!H:H, MATCH(G3, 'ELIGIBLE GIRLS'!D:D, 0)),\n      \"\"\n   )\n)","v":"Mukesh Kumhar"}]
[5,"संरक्षक का नाम (माता पिता के जीवित ना होने की स्थिति में )"]
[6,"माता-पिता के जीवित ना होने की स्थिति में माता-पिता का \nमृत्यु प्रमाण पत्र जारी करने की दिनांक व क्रमांक "]
[7,"छात्रा की जन्मतिथि (अंकों एंव शब्दों में )",null,null,{"$f":"IFERROR(\n   INDEX('ELIGIBLE GIRLS'!K:K, MATCH(G3, 'ELIGIBLE GIRLS'!A:A, 0)),\n   IFERROR(\n      INDEX('ELIGIBLE GIRLS'!K:K, MATCH(G3, 'ELIGIBLE GIRLS'!D:D, 0)),\n      \"\"\n   )\n)","v":"2020-05-15"}]
[8,"कक्षा एंव सेक्शन जिसमे अध्ययनरत है ",null,null,{"$f":"IFERROR(\n   INDEX('ELIGIBLE GIRLS'!B:B, MATCH(G3, 'ELIGIBLE GIRLS'!A:A, 0)) & \"   \" &\n   INDEX('ELIGIBLE GIRLS'!C:C, MATCH(G3, 'ELIGIBLE GIRLS'!A:A, 0)),\n   IFERROR(\n      INDEX('ELIGIBLE GIRLS'!B:B, MATCH(G3, 'ELIGIBLE GIRLS'!D:D, 0)) & \"   \" &\n      INDEX('ELIGIBLE GIRLS'!C:C, MATCH(G3, 'ELIGIBLE GIRLS'!D:D, 0)),\n      \"\"\n   )\n)","v":"1   A"}]
[9,"छात्रा का विद्यालय में प्रवेश दिनांक एंव एस. आर नंबर ",null,null,{"$f":"IFERROR(\n   TEXT(INDEX('ELIGIBLE GIRLS'!E:E, MATCH(G3, 'ELIGIBLE GIRLS'!A:A, 0)), \"dd-mm-yyyy\") & \" / \" &\n   INDEX('ELIGIBLE GIRLS'!D:D, MATCH(G3, 'ELIGIBLE GIRLS'!A:A, 0)),\n   IFERROR(\n      TEXT(INDEX('ELIGIBLE GIRLS'!E:E, MATCH(G3, 'ELIGIBLE GIRLS'!D:D, 0)), \"dd-mm-yyyy\") & \" / \" &\n      INDEX('ELIGIBLE GIRLS'!D:D, MATCH(G3, 'ELIGIBLE GIRLS'!D:D, 0)),\n      \"\"\n   )\n)","v":"09-07-2025 / 926"}]
[10,"गत कक्षा के विद्यालय का नाम व पता (तृतीय किश्त के\n अलावा उतरवर्ती किश्तों के लिए )"]
[11,"अभिभावक /संरक्षक के मोबाईल नंबर ",null,null,{"$f":"IFERROR(\n   INDEX('ELIGIBLE GIRLS'!W:W, MATCH(G3, 'ELIGIBLE GIRLS'!A:A, 0)),\n   IFERROR(INDEX('ELIGIBLE GIRLS'!W:W, MATCH(G3, 'ELIGIBLE GIRLS'!D:D, 0)), \"\")\n)","v":77426475578}]
[12,"जाति वर्ग (अजा/अजजा/अन्य पिछड़ा वर्ग/सामान्य/\nअल्पसंख्यक/एमबीसी)",null,null,{"$f":"IFERROR(\n   INDEX('ELIGIBLE GIRLS'!P:P, MATCH(G3, 'ELIGIBLE GIRLS'!A:A, 0)),\n   IFERROR(INDEX('ELIGIBLE GIRLS'!P:P, MATCH(G3, 'ELIGIBLE GIRLS'!D:D, 0)), \"\")\n)","v":"OBC"}]
[13,"धर्म ",null,null,{"$f":"IFERROR(\n   INDEX('ELIGIBLE GIRLS'!Q:Q, MATCH(G3, 'ELIGIBLE GIRLS'!A:A, 0)),\n   IFERROR(INDEX('ELIGIBLE GIRLS'!Q:Q, MATCH(G3, 'ELIGIBLE GIRLS'!D:D, 0)), \"\")\n)","v":"Hindu"}]
[14,"छात्रा का आधार नंबर/एनरोलमेंट नंबर "]
[15,"जन आधार नंबर /एनरोलमेंट नंबर"]
[16,"स्थाई पता ",null,null,{"$f":"IFERROR(\n   INDEX('ELIGIBLE GIRLS'!X:X, MATCH(G3, 'ELIGIBLE GIRLS'!A:A, 0)),\n   IFERROR(INDEX('ELIGIBLE GIRLS'!X:X, MATCH(G3, 'ELIGIBLE GIRLS'!D:D, 0)), \"\")\n)","v":"xyz  ajmer ,rajasthan 3333338"}]
[]
[null,"नोट :- वांछित दस्तावेज संलग्न करते हुए सामने के कॉलम में ☑ का निशान अंकित करे "]
[]
["क्रम\nसंख्या ","योजना के विस्तृत दिशानिर्देशों के अनुसार संलग्न किए जाने वाले दस्तावेज़ ",{"$nulls":3},"संलग्न कर ✓करे "]
[1,"PREGNANCY CHILD TRACKING AND HEALTH SERVICE\nMANAGEMENT SYSTEM ID (PCTS ID/CARD)",{"$nulls":3},{"$f":"IF(E8<>\"\",\"☑\",\"☐\")","v":"☑"}]
[2,"दो  संतानो सम्बन्धि स्वघोषणा प्रमाण पत्र (अभिभावक /संरक्षक द्वारा)",{"$nulls":3},{"$f":"IF(E9<>\"\",\"☑\",\"☐\")","v":"☑"}]
[3,"जन्म प्रमाण पत्र,जन आधार कार्ड एंव आधार कार्ड (अभिभावक /संरक्षक द्वारा प्रमाणित)",{"$nulls":3},{"$f":"IF(E10<>\"\",\"☑\",\"☐\")","v":"☑"}]
[3,"माता-पिता के जीवित ना होने की स्थिति में माता-पिता के मृत्यु \nप्रमाण पत्र की संरक्षक के द्वारा प्रमाणित प्रति ",{"$nulls":3},{"$f":"IF(E12<>\"\",\"☑\",\"☐\")","v":"☐"}]
{"$rows_left_out":22}