{"text_format":"3","workbook":"xlsx","n_sheets":4,"sheets":["निर्देश","Student_Record","ELIGIBLE GIRLS","form"],"not_rendered":{"images":10,"macros":1,"defined_names":4,"comments":1},"read":"whole","date_system":"1900"}

{"sheet":"निर्देश","index":0,"n_rows":33,"n_cols":11,"rows_kept":33,"merged":[[2,2,2,10],[8,1,8,11],[21,1,21,11],[22,2,28,3],[22,4,28,5],[22,6,28,7],[22,8,27,9],[22,10,27,11],[28,10,28,11],[29,0,29,12],[30,2,30,11],[31,2,31,11],[32,2,32,11]]}
[]
[]
[null,null,"महत्वपूर्ण निर्देश "]
[null,"1. जैसे ही आप excle शीट ओपन करते है आपको सबसे पहला कार्य करना है की फॉर्म शीट में जिस सत्र के फॉर्म प्रिन्ट करने है उस सत्र को लिखे (उदाहरण - 2024-25,2022-2023 )"]
[null,"2. यदि आपको खाली फॉर्म का प्रिन्ट लेना है तो सर्च बॉक्स मे कोई भी गलत वैल्यू इनपुट करे (ऐसा SR नंबर जो लाड़ो योजना में न हो ) उसके बाद फॉर्म खाली हो जाएगा उसका प्रिन्ट ले"]
[null,"3. अपनी स्कूल के स्टूडेंट का डाटा शाला दर्पण के डाउनलोड module से डाउनलोड कर student_Record शीट में पेस्ट करे ताकि प्रिन्ट उसी अनुरूप आए "]
[null,"5. यदि आपके पीसी में फाइल काम नहीं कर रही है तो एक बार यह चेक करे  की आपका Developer tab ओपन है या नहीं "]
[null,"6. शीट काम नहीं कर रही है तो उक्त सेटिंग को चेक करे यदि developer tab ओपन नहीं है तो नीचे दिए लिंक से विडिओ देख कर tab ओपन करे"]
[null,"विडिओ देखने के लिए क्लिक करे "]
[null,"7. यदि आपका डेवलपर टैब ओपन है तो नीचे दिए गई सेटिंग को चेक करे यदि फिर भी समस्या बनी रहती है तो हमे मेल करे shivrajmeghwanshibarola567@gmail.com"]
{"$rows_empty":11}
[null,"मार्गदर्शक "]
[null,null," Ahwini Kumar",null,"Mr. Heera Lal Jat",null,"Ram Karan Beniwal"]
[]
[]
[]
[]
[]
[{"$nulls":8},"Mr. Parmanand Meghwal",null,"Mr. Shivraj Meghwanshi"]
["हमारे द्वारा बनाई गई आवश्यक फाइल डॉक्यूमेंट एक्सल फाइल प्राप्त करने के लिए निमन्नालिखित लिंक पर क्लिक करे  "]
[null,{"$f":"_xlfn.UNICHAR(9758)","v":"☞"},"https://rajsevak.com/shivraj-meghwanshi/"]
[null,{"$f":"_xlfn.UNICHAR(9758)","v":"☞"},"https://rajteachers.co/shivraj-meghvanshi"]
[null,"☞","https://www.ashwinisharma.com/p/shivraj-meghwanshi-excel-program-excel.html"]

{"sheet":"Student_Record","index":1,"n_rows":364,"n_cols":30,"rows_kept":364}
["Class","Section","SRNO","DOA","Name","Late Status","FatherName","MotherName","Gender","Dob","ClassRollNo","ExamRollNumber","School Total Working Days","Student Total Attendence","Category","Religion","Previous Year Marks","Name Of School","School UDise Code","Aadhar No of Student","Bhamashash Card","Mobile No Student(Father/Mother/Guardian","Student Permanent Address","Annual Parental Income","CWSN Status","BPL Status","Minority Status","Age On Present(In Years)","Co-Curricular Activity","Distance From School"]
[1,"A",973,"2025-10-03","Anisha Choudhary",null,"Prahlad Choudhary","Tina","F","2017-09-28",null,null,171,103,"OBC",null,null,"GOVT. SENIOR SECONDARY SCHOOL",8210302,null,null,77426475575,"xyz  ajmer ,rajasthan 3333335",null,"N","Y",null,9,null,1]
[1,"A",968,"2025-08-18","Anjali",null,"Sanwaraa","Samotra","F","2018-08-20",null,null,171,133,"OBC","Hindu",null,"GOVT. SENIOR SECONDARY SCHOOL",8210302,null,null,77426475576,"xyz  ajmer ,rajasthan 3333336",55000,"N","N","No",8,"None",0]
[1,"A",970,"2025-09-18","Ankit",null,"Omprakash","Jamna","M","2019-11-17",null,null,171,127,"OBC",null,null,"GOVT. SENIOR SECONDARY SCHOOL",8210302,null,null,77426475577,"xyz  ajmer ,rajasthan 3333337",null,"N","Y",null,7,null,1]
[1,"A",926,"2025-07-09","Arti Prajapat",null,"Mukesh Kumhar","Shrwani","F","2020-05-15",null,null,171,147,"OBC","Hindu",null,"GOVT. SENIOR SECONDARY SCHOOL",8210302,null,null,77426475578,"xyz  ajmer ,rajasthan 3333338",48000,"N","N","No",6,"None",0]
[1,"A",959,"2025-07-30","Dipika Prajapat",null,"Madan Lal Prajapat","Lali Devi","F","2019-03-20",null,null,171,143,"OBC","Hindu",null,"GOVT. SENIOR SECONDARY SCHOOL",8210302,null,null,77426475579,"xyz  ajmer ,rajasthan 3333339",50000,"N","N","No",7,"None",1]
[1,"A",941,"2025-07-16","Jyoti",null,"Mukesh","Maina","F","2019-04-15",null,null,171,143,"OBC","Hindu",null,"GOVT. SENIOR SECONDARY SCHOOL",8210302,null,null,77426475580,"xyz  ajmer ,rajasthan 3333340",48000,"N","N","No",7,"None",1]
[1,"A",924,"2025-07-01","Kismat Choudhary",null,"Jay Prakash Choudhary","Bharti","F","2019-05-01",null,null,171,150,"OBC","Hindu",null,"GOVT. SENIOR SECONDARY SCHOOL",8210302,null,null,77426475581,"xyz  ajmer ,rajasthan 3333341",60000,"N","N","No",7,"None",1]
[1,"A",971,"2025-10-03","Monika Choudhary",null,"Prahlad Jat","Tina","F","2019-08-15",null,null,171,106,"OBC",null,null,"GOVT. SENIOR SECONDARY SCHOOL",8210302,null,null,77426475582,"xyz  ajmer ,rajasthan 3333342",null,"N","Y",null,7,null,1]
[1,"A",951,"2025-07-21","Neeraj Bansali",null,"ranjeet","Pushpa","M","2020-03-22",null,null,171,144,"SC","Hindu",null,"GOVT. SENIOR SECONDARY SCHOOL",8210302,null,null,77426475583,"xyz  ajmer ,rajasthan 3333343",48000,"N","N","No",6,"None",1]
[1,"A",937,"2025-07-14","Payal",null,"Pankaj Kumar","Kanchan","F","2019-08-14",null,null,171,144,"OBC","Hindu",null,"GOVT. SENIOR SECONDARY SCHOOL",8210302,null,null,77426475584,"xyz  ajmer ,rajasthan 3333344",48000,"N","N","No",7,"None",1]
[1,"A",962,"2025-08-14","Riya Nat",null,"Jitendra","Ishu Nat","F","2019-12-09",null,null,171,134,"SC","Hindu",null,"GOVT. SENIOR SECONDARY SCHOOL",8210302,null,null,77426475585,"xyz  ajmer ,rajasthan 3333345",60000,"N","N","No",7,"None",0]
[1,"A",934,"2025-07-14","Tannu Jat",null,"Sardar","Surgyan","F","2017-09-15",null,null,171,126,"OBC","Hindu",null,"GOVT. SENIOR SECONDARY SCHOOL",8210302,null,null,77426475586,"xyz  ajmer ,rajasthan 3333346",48000,"N","N","No",9,"None",1]
[2,"A",907,"2024-07-25","Aarushi",null,"Satyanarayan Jat","Ajodya","F","2019-04-19",null,null,171,149,"OBC","Hindu",null,"GOVT. SENIOR SECONDARY SCHOOL",8210302,"XXXX5052",null,77426475587,"xyz  ajmer ,rajasthan 3333347",0,"N","N","No",7,"None",0]
[2,"A",920,"2024-08-20","Anjali Meghwanshi",null,"Shankar","Gyarsi Meghwanshi","F","2019-03-21",null,null,171,145,"SC","Hindu",null,"GOVT. SENIOR SECONDARY SCHOOL",8210302,"XXXX0328",null,77426475588,"xyz  ajmer ,rajasthan 3333348",60000,"N","N","No",7,"None",0]
[2,"A",906,"2024-07-25","Annu Jat",null,"Ramswaroop","Bhagawati","F","2019-02-11",null,null,171,150,"OBC","Hindu",null,"GOVT. SENIOR SECONDARY SCHOOL",8210302,"XXXX6543",null,77426475589,"xyz  ajmer ,rajasthan 3333349",0,"N","N","No",7,"None",0]
[2,"A",901,"2024-07-19","Bhumika Sain",null,"Rajesh Sain","Lalita Sain","F","2019-03-28",null,null,171,144,"OBC","Hindu",null,"GOVT. SENIOR SECONDARY SCHOOL",8210302,"XXXX8084",null,77426475590,"xyz  ajmer ,rajasthan 3333350",0,"N","N","No",7,"None",0]
[2,"A",885,"2024-07-08","Dinesh Regar",null,"Kalu Ram","Rinku","M","2018-07-06",null,null,171,148,"SC","Hindu",null,"GOVT. SENIOR SECONDARY SCHOOL",8210302,"XXXX8689",null,77426475591,"xyz  ajmer ,rajasthan 3333351",0,"N","N","No",8,"None",0]
[2,"A",914,"2024-07-31","Jagdish Prajapat",null,"Hansraj","Prem","M","2019-08-01",null,null,171,148,"OBC","Hindu",null,"GOVT. SENIOR SECONDARY SCHOOL",8210302,"XXXX9393",null,77426475592,"xyz  ajmer ,rajasthan 3333352",0,"N","N","No",7,"None",0]
[2,"A",877,"2024-07-04","Khushi",null,"Mukesh","Shrwani","F","2018-05-19",null,null,171,143,"OBC","Hindu",null,"GOVT. SENIOR SECONDARY SCHOOL",8210302,"XXXX9543",null,77426475593,"xyz  ajmer ,rajasthan 3333353",55000,"N","N","No",8,"None",0]
[2,"A",922,"2024-09-02","Khushi Jat",null,"Parmeshwar","Shanti","F","2018-08-12",null,null,171,145,"OBC","Hindu",null,"GOVT. SENIOR SECONDARY SCHOOL",8210302,"XXXX6362",null,77426475594,"xyz  ajmer ,rajasthan 3333354",50000,"N","N","No",8,"None",0]
[2,"A",921,"2024-08-20","Lokesh Prajapat",null,"Hardayal","Sona","M","2018-05-15",null,null,171,148,"OBC","Hindu",null,"GOVT. SENIOR SECONDARY SCHOOL",8210302,"XXXX6114",null,77426475595,"xyz  ajmer ,rajasthan 3333355",60000,"N","N","No",8,"None",0]
[2,"A",878,"2024-07-04","Mansha Jat",null,"Prem Chand Jat","Gamla Jat","F","2018-05-13",null,null,171,149,"OBC","Hindu",null,"GOVT. SENIOR SECONDARY SCHOOL",8210302,"XXXX9859",null,77426475596,"xyz  ajmer ,rajasthan 3333356",60000,"N","N","No",8,"None",0]
[2,"A",875,"2024-07-02","Mona",null,"Ramesh Chand","Gita Devi","F","2018-06-11",null,null,171,150,"SC","Hindu",null,"GOVT. SENIOR SECONDARY SCHOOL",8210302,"XXXX2685",null,77426475597,"xyz  ajmer ,rajasthan 3333357",60000,"N","N","No",8,"None",0]
[2,"A",884,"2024-07-06","Monika Prajapat",null,"Prakash","Parvati","F","2018-04-20",null,null,171,146,"OBC","Hindu",null,"GOVT. SENIOR SECONDARY SCHOOL",8210302,"XXXX8935",null,77426475598,"xyz  ajmer ,rajasthan 3333358",0,"N","N","No",8,"None",0]
[2,"A",879,"2024-07-05","Pooja Jat",null,"Shankar","Sharda Devi","F","2018-08-25",null,null,171,148,"OBC","Hindu",null,"GOVT. SENIOR SECONDARY SCHOOL",8210302,"XXXX5942",null,77426475599,"xyz  ajmer ,rajasthan 3333359",0,"N","N","No",8,"None",0]
[2,"A",880,"2024-07-05","Priya Jat",null,"Ganesh","Saroj Devi","F","2017-12-30",null,null,171,148,"OBC","Hindu",null,"GOVT. SENIOR SECONDARY SCHOOL",8210302,"XXXX5265",null,77426475600,"xyz  ajmer ,rajasthan 3333360",0,"N","N","No",9,"None",0]
[2,"A",881,"2024-07-06","Radhika",null,"Dhanraj","Mathra","F","2018-06-01",null,null,171,146,"OBC","Hindu",null,"GOVT. SENIOR SECONDARY SCHOOL",8210302,"XXXX5589",null,77426475601,"xyz  ajmer ,rajasthan 3333361",0,"N","N","No",8,"None",0]
[2,"A",923,"2024-09-02","Rajveer Jat",null,"Prithviraj","Suman Devi","M","2019-11-09",null,null,171,149,"OBC","Hindu",null,"GOVT. SENIOR SECONDARY SCHOOL",8210302,"XXXX6423",null,77426475602,"xyz  ajmer ,rajasthan 3333362",55000,"N","N","No",7,"None",0]
[2,"A",905,"2024-07-19","Rinku Prajapat",null,"Kailash","Parvati","F","2018-11-15",null,null,171,148,"OBC","Hindu",null,"GOVT. SENIOR SECONDARY SCHOOL",8210302,"XXXX8744",null,77426475603,"xyz  ajmer ,rajasthan 3333363",0,"N","N","No",8,"None",0]
[2,"A",899,"2024-07-18","Shivangi",null,"Hanuman","Chaina","F","2017-03-23",null,null,171,147,"OBC","Hindu",null,"GOVT. SENIOR SECONDARY SCHOOL",8210302,"XXXX4862",null,77426475604,"xyz  ajmer ,rajasthan 3333364",0,"N","N","No",9,"None",0]
[2,"A",874,"2024-07-02","Shivani",null,"Prithvi Raj","Suman Devi","F","2018-10-20",null,null,171,146,"OBC","Hindu",null,"GOVT. SENIOR SECONDARY SCHOOL",8210302,"XXXX9004",null,77426475605,"xyz  ajmer ,rajasthan 3333365",60000,"N","N","No",8,"None",0]
[2,"A",882,"2024-07-06","Tannu",null,"Basram","Shila","F","2018-06-14",null,null,171,149,"OBC","Hindu",null,"GOVT. SENIOR SECONDARY SCHOOL",8210302,"XXXX8326",null,77426475606,"xyz  ajmer ,rajasthan 3333366",0,"N","N","No",8,"None",0]
[2,"A",876,"2024-07-02","Vinod Choudhary",null,"Mangi Lal Choudhary","Shobhag Devi Jat","M","2017-09-04",null,null,171,138,"OBC","Hindu",null,"GOVT. SENIOR SECONDARY SCHOOL",8210302,"XXXX7552",null,77426475607,"xyz  ajmer ,rajasthan 3333367",60000,"N","N","No",9,"None",0]
[3,"A",965,"2025-08-14","aaliya",null,"Nasir","Biri","F","2015-02-11",null,null,171,135,"OBC","Muslim",null,"GOVT. SENIOR SECONDARY SCHOOL",8210302,null,null,77426475608,"xyz  ajmer ,rajasthan 3333368",60000,"N","N","Yes",11,"None",0]
[3,"A",814,"2023-07-06","Achuki",null,"Sanwara","Samotra Devi","F","2016-02-06",null,null,171,149,"OBC","Hindu",null,"GOVT. SENIOR SECONDARY SCHOOL",8210302,"XXXX5082",null,77426475609,"xyz  ajmer ,rajasthan 3333369",0,"N","N","No",10,"None",0]
[3,"A",837,"2023-07-15","Asha",null,"Mahaveer","Foola","F","2016-05-08",null,null,171,142,"OBC","Hindu",null,"GOVT. SENIOR SECONDARY SCHOOL",8210302,"XXXX4366",null,77426475610,"xyz  ajmer ,rajasthan 3333370",0,"N","N","No",10,"None",0]
[3,"A",853,"2023-07-21","Ashika",null,"Hariram","Lada Devi","F","2017-01-23",null,null,171,149,"OBC","Hindu",null,"GOVT. SENIOR SECONDARY SCHOOL",8210302,"XXXX1296",null,77426475611,"xyz  ajmer ,rajasthan 3333371",0,"N","N","No",9,"None",0]
[3,"A",893,"2024-07-15","Bhawana Choudhary",null,"Mahaveer Prasad Jat","Sita","F","2017-08-31",null,null,171,150,"OBC","Hindu",null,"GOVT. SENIOR SECONDARY SCHOOL",8210302,"XXXX5647",null,77426475612,"xyz  ajmer ,rajasthan 3333372",50000,"N","N","No",9,"None",0]
[3,"A",863,"2023-08-10","Deepak Jat",null,"Ramprasad","Shila Devi","M","2017-10-19",null,null,171,114,"OBC","Hindu",null,"GOVT. SENIOR SECONDARY SCHOOL",8210302,"XXXX2722",null,77426475613,"xyz  ajmer ,rajasthan 3333373",0,"N","N","No",9,"None",0]
[3,"A",810,"2023-07-04","Dilkhush",null,"Golu Ram","Ramkani","M","2017-06-03",null,null,171,148,"OBC","Hindu",null,"GOVT. SENIOR SECONDARY SCHOOL",8210302,"XXXX0307",null,77426475614,"xyz  ajmer ,rajasthan 3333374",0,"N","N","No",9,"None",0]
[3,"A",902,"2024-07-19","Hansa Prajapat",null,"Prakash Prajapat","Parvati","F","2016-08-21",null,null,171,150,"OBC","Hindu",null,"GOVT. SENIOR SECONDARY SCHOOL",8210302,"XXXX3911",null,77426475615,"xyz  ajmer ,rajasthan 3333375",40000,"N","N","No",10,"None",0]
[3,"A",844,"2023-07-18","Khushi",null,"Pardhan","Mamata","F","2017-01-16",null,null,171,150,"OBC","Hindu",null,"GOVT. SENIOR SECONDARY SCHOOL",8210302,"XXXX9153",null,77426475616,"xyz  ajmer ,rajasthan 3333376",0,"N","N","No",9,"None",0]
[3,"A",929,"2025-07-10","Komal Prajapat",null,"Gopal Lal Kumhar","Rekha","F","2013-11-05",null,null,171,147,"OBC","Hindu",null,"GOVT. SENIOR SECONDARY SCHOOL",8210302,"XXXX7478",null,77426475617,"xyz  ajmer ,rajasthan 3333377",60000,"Y","N","No",13,"None",0]
[3,"A",822,"2023-07-11","Kumkum",null,"Shankar","Sharda Devi","F","2017-05-25",null,null,171,149,"OBC","Hindu",null,"GOVT. SENIOR SECONDARY SCHOOL",8210302,"XXXX6428",null,77426475618,"xyz  ajmer ,rajasthan 3333378",0,"N","N","No",9,"None",0]
[3,"A",842,"2023-07-18","Mitali prajapat",null,"Shetan Prajapat","Ramkanya Devi","F","2017-11-07",null,null,171,149,"OBC","Hindu",null,"GOVT. SENIOR SECONDARY SCHOOL",8210302,"XXXX7768",null,77426475619,"xyz  ajmer ,rajasthan 3333379",0,"N","N","No",9,"None",0]
[3,"A",811,"2023-07-04","Nesu",null,"Ramswarup","Bhagawati Devi","F","2017-03-23",null,null,171,147,"OBC","Hindu",null,"GOVT. SENIOR SECONDARY SCHOOL",8210302,"XXXX1474",null,77426475620,"xyz  ajmer ,rajasthan 3333380",0,"N","N","No",9,"None",0]
[3,"A",813,"2023-07-05","Payal Bansali",null,"Chotu","Mamta Devi","F","2017-11-08",null,null,171,147,"SC","Hindu",null,"GOVT. SENIOR SECONDARY SCHOOL",8210302,"XXXX2253",null,77426475621,"xyz  ajmer ,rajasthan 3333381",0,"N","N","No",9,"None",0]
[3,"A",812,"2023-07-04","Priyanka Prajapat",null,"Haradayal","Sona Devi","F","2017-01-01",null,null,171,148,"OBC","Hindu",null,"GOVT. SENIOR SECONDARY SCHOOL",8210302,"XXXX3485",null,77426475622,"xyz  ajmer ,rajasthan 3333382",0,"N","N","No",9,"None",0]
[3,"A",894,"2024-07-15","Radhika Jat",null,"Hanuman Jat","Kamlesh","F","2016-08-03",null,null,171,148,"OBC","Hindu",null,"GOVT. SENIOR SECONDARY SCHOOL",8210302,"XXXX9145",null,77426475623,"xyz  ajmer ,rajasthan 3333383",60000,"N","N","No",10,"None",0]
[3,"A",839,"2023-07-15","Sonu Bheel",null,"Hanuman","Neraj","F","2016-06-16",null,null,171,136,"ST","Hindu",null,"GOVT. SENIOR SECONDARY SCHOOL",8210302,"XXXX0001",null,77426475624,"xyz  ajmer ,rajasthan 3333384",0,"N","N","No",10,"None",1]
[3,"A",831,"2023-07-13","Yartika Sain",null,"Rajesh Sain","Lalita Sain","F","2017-08-30",null,null,171,147,"OBC","Hindu",null,"GOVT. SENIOR SECONDARY SCHOOL",8210302,"XXXX6548",null,77426475625,"xyz  ajmer ,rajasthan 3333385",0,"N","N","No",9,"None",0]
[4,"A",762,"2022-07-05","Aamna",null,"Shahbuddin","Madina Bano","F","2017-01-03",null,null,171,146,"OBC","Hindu",null,"GOVT. SENIOR SECONDARY SCHOOL",8210302,"XXXX1402",null,77426475626,"xyz  ajmer ,rajasthan 3333386",48000,"N","N","No",9,"None",0]
[4,"A",769,"2022-07-12","Anjali",null,"Prithvi Raj","Suman Devi","F","2017-03-05",null,null,171,150,"OBC","Hindu",null,"GOVT. SENIOR SECONDARY SCHOOL",8210302,"XXXX8597",null,77426475627,"xyz  ajmer ,rajasthan 3333387",48000,"N","N","No",9,"None",0]
[4,"A",803,"2022-08-17","Anju",null,"Hansraj","Kali","F","2017-01-23",null,null,171,148,"OBC","Hindu",null,"GOVT. SENIOR SECONDARY SCHOOL",8210302,"XXXX9019",null,77426475628,"xyz  ajmer ,rajasthan 3333388",50000,"N","N","No",9,"None",0]
[4,"A",809,"2022-12-12","Anju",null,"Mahendra","Kopan","F","2016-06-22",null,null,171,146,"OBC","Hindu",null,"GOVT. SENIOR SECONDARY SCHOOL",8210302,"XXXX0096",null,77426475629,"xyz  ajmer ,rajasthan 3333389",48000,"N","N","No",10,"None",2]
[4,"A",794,"2022-07-27","Ankit",null,"Kalu Ram","Rinku","M","2016-06-01",null,null,171,150,"SC",null,null,"GOVT. SENIOR SECONDARY SCHOOL",8210302,"XXXX7750",null,77426475630,"xyz  ajmer ,rajasthan 3333390",null,"N","Y",null,10,null,0]
[4,"A",770,"2022-07-12","Deepika Jat",null,"Prem Chand Jat","Gamla Jat","F","2016-11-17",null,null,171,149,"OBC","Hindu",null,"GOVT. SENIOR SECONDARY SCHOOL",8210302,"XXXX0466",null,77426475631,"xyz  ajmer ,rajasthan 3333391",0,"N","N","No",10,"None",0]
[4,"A",798,"2022-07-30","Dilkhush",null,"Lalaram","Mathara","M","2017-01-20",null,null,171,147,"OBC",null,null,"GOVT. SENIOR SECONDARY SCHOOL",8210302,"XXXX9772",null,77426475632,"xyz  ajmer ,rajasthan 3333392",null,"N","Y",null,9,null,0]
[4,"A",781,"2022-07-13","Dilkhush Prajapat",null,"Dharmichand","Neela","M","2016-11-12",null,null,171,148,"OBC",null,null,"GOVT. SENIOR SECONDARY SCHOOL",8210302,"XXXX6632",null,77426475633,"xyz  ajmer ,rajasthan 3333393",null,"N","Y",null,10,null,0]
[4,"A",808,"2022-09-30","Happy",null,"Naresh","Pooja","M","2016-05-12",null,null,171,146,"SC",null,null,"GOVT. SENIOR SECONDARY SCHOOL",8210302,"XXXX6499",null,77426475634,"xyz  ajmer ,rajasthan 3333394",null,"N","N",null,10,"None",0]
[4,"A",780,"2022-07-13","Kanaram Prajapat",null,"Budhraj","Sumitra","M","2016-12-05",null,null,171,150,"OBC",null,null,"GOVT. SENIOR SECONDARY SCHOOL",8210302,"XXXX1435",null,77426475635,"xyz  ajmer ,rajasthan 3333395",null,"N","N",null,10,"None",0]
[4,"A",787,"2022-07-22","Khusi Prajapat",null,"Kailash","Parvati","F","2016-09-13",null,null,171,147,"OBC","Hindu",null,"GOVT. SENIOR SECONDARY SCHOOL",8210302,"XXXX5841",null,77426475636,"xyz  ajmer ,rajasthan 3333396",48000,"N","N","No",10,"None",0]
[4,"A",872,"2023-10-27","Monika",null,"Kanaram","Norati Devi","F","2017-04-02",null,null,171,149,"OBC","Hindu",null,"GOVT. SENIOR SECONDARY SCHOOL",8210302,"XXXX6276",null,77426475637,"xyz  ajmer ,rajasthan 3333397",48000,"N","N","No",9,"None",0]
[4,"A",801,"2022-08-17","Nitesh Jat",null,"Sukhdev Jat","Samotra","M","2017-07-30",null,null,171,149,"OBC",null,null,"GOVT. SENIOR SECONDARY SCHOOL",8210302,"XXXX6250",null,77426475638,"xyz  ajmer ,rajasthan 3333398",null,"N","Y",null,9,null,0]
[4,"A",766,"2022-07-12","Rakesh",null,"Heamraj","Ladi","M","2015-10-15",null,null,171,149,"OBC","Hindu",null,"GOVT. SENIOR SECONDARY SCHOOL",8210302,"XXXX6441",null,77426475639,"xyz  ajmer ,rajasthan 3333399",48000,"N","N","No",11,"None",0]
[4,"A",805,"2022-09-03","Rihan Peenara",null,"Peeru Peenara","Gulshan","M","2016-10-15",null,null,171,145,"OBC",null,null,"GOVT. SENIOR SECONDARY SCHOOL",8210302,"XXXX4503",null,77426475640,"xyz  ajmer ,rajasthan 3333400",null,"N","Y",null,10,null,0]
[4,"A",925,"2025-07-09","Rinu",null,"Basram","Sheela","F","2017-01-03",null,null,171,149,"OBC","Hindu",null,"GOVT. SENIOR SECONDARY SCHOOL",8210302,null,null,77426475641,"xyz  ajmer ,rajasthan 3333401",48000,"N","N","No",9,"None",1]
[4,"A",816,"2023-07-11","Shimla",null,"Ramraj Jat","Rameshwari Devi","F","2016-01-10",null,null,171,149,"OBC","Hindu",null,"GOVT. SENIOR SECONDARY SCHOOL",8210302,"XXXX7038",null,77426475642,"xyz  ajmer ,rajasthan 3333402",0,"N","N","No",10,"None",0]
[4,"A",760,"2022-07-05","Tannu",null,"Sonu","Gaytri","F","2016-11-28",null,null,171,146,"SC","Hindu",null,"GOVT. SENIOR SECONDARY SCHOOL",8210302,"XXXX5231",null,77426475643,"xyz  ajmer ,rajasthan 3333403",50000,"N","N","No",10,"None",0]
[4,"A",768,"2022-07-12","Virat",null,"Ramraj","Manju","M","2015-09-07",null,null,171,149,"SC","Hindu",null,"GOVT. SENIOR SECONDARY SCHOOL",8210302,"XXXX4918",null,77426475644,"xyz  ajmer ,rajasthan 3333404",48000,"N","N","No",11,"None",0]
[5,"A",957,"2025-07-26","Alvina",null,"Basir","Shanaj","F","2014-11-25",null,null,147,88,"OBC","Muslim",null,"GOVT. SENIOR SECONDARY SCHOOL",8210302,null,null,77426475645,"xyz  ajmer ,rajasthan 3333405",60000,"N","N","Yes",12,"None",1]
[5,"A",840,"2023-07-15","Anju",null,"Mahaveer Bheel","Mandraj","F","2014-01-01",null,null,147,86,"ST","Hindu",null,"GOVT. SENIOR SECONDARY SCHOOL",8210302,"XXXX9382",null,77426475646,"xyz  ajmer ,rajasthan 3333406",48000,"N","N","No",12,"None",1]
[5,"A",717,"2021-08-05","Anju",null,"Dhanraj Choudhary","Mathara Devi","F","2016-02-10",null,null,147,87,"OBC","Hindu",null,"GOVT. SENIOR SECONDARY SCHOOL",8210302,"XXXX4161",null,77426475647,"xyz  ajmer ,rajasthan 3333407",80000,"N","N","No",10,"None",0]
[5,"A",677,"2021-06-22","Astha Jat",null,"Ganesh Jat","Saroj Devi","F","2016-07-17",null,null,147,89,"OBC","Hindu",null,"GOVT. SENIOR SECONDARY SCHOOL",8210302,"XXXX8917",null,77426475648,"xyz  ajmer ,rajasthan 3333408",60000,"N","N","No",10,"None",0]
[5,"A",684,"2021-07-12","Bhanu Jat",null,"Hariram","Asha Devi Choudhary","M","2015-12-30",null,null,147,88,"OBC","Hindu",null,"GOVT. SENIOR SECONDARY SCHOOL",8210302,"XXXX9454",null,77426475649,"xyz  ajmer ,rajasthan 3333409",60000,"N","N","No",11,"None",0]
[5,"A",939,"2025-07-15","Dharmraj Prajapat",null,"Budhraj Prajapat","Sumitra Devi","M","2014-12-22",null,null,147,89,"OBC","Hindu",null,"GOVT. SENIOR SECONDARY SCHOOL",8210302,"XXXX7411",null,77426475650,"xyz  ajmer ,rajasthan 3333410",48000,"N","N","No",12,"None",0]
[5,"A",719,"2021-08-09","Dilkhush",null,"Mahaveer bhil","Mandraj","M","2015-12-14",null,null,147,89,"ST","Hindu",null,"GOVT. SENIOR SECONDARY SCHOOL",8210302,"XXXX5492",null,77426475651,"xyz  ajmer ,rajasthan 3333411",60000,"N","N","No",11,"None",0]
[5,"A",715,"2021-08-04","Jiya Nat",null,"Raju","Shobha","F","2015-08-28",null,null,147,83,"SC","Hindu",null,"GOVT. SENIOR SECONDARY SCHOOL",8210302,"XXXX7673",null,77426475652,"xyz  ajmer ,rajasthan 3333412",50000,"N","N","No",11,"None",0]
[5,"A",835,"2023-07-13","Kali Jat",null,"Kailash","Ramkanya","F","2012-06-04",null,null,147,88,"OBC","Hindu",null,"GOVT. SENIOR SECONDARY SCHOOL",8210302,"XXXX4543",null,77426475653,"xyz  ajmer ,rajasthan 3333413",48000,"N","N","No",14,"None",0]
[5,"A",710,"2021-07-30","Khushboo",null,"Mahaveer Meghavanshi","Fornta","F","2016-05-10",null,null,147,89,"SC","Hindu",null,"GOVT. SENIOR SECONDARY SCHOOL",8210302,"XXXX1900",null,77426475654,"xyz  ajmer ,rajasthan 3333414",80000,"N","N","No",10,"None",0]
[5,"A",702,"2021-07-22","Kiran Bhil",null,"Bablu Bhil","Rekha Devi","F","2013-01-01",null,null,147,88,"ST","Hindu",null,"GOVT. SENIOR SECONDARY SCHOOL",8210302,"XXXX6724",null,77426475655,"xyz  ajmer ,rajasthan 3333415",60000,"N","N","No",13,"None",0]
[5,"A",690,"2021-07-14","Komal prajapat",null,"Panchu prajapat","Maya","F","2016-02-02",null,null,147,87,"OBC","Hindu",null,"GOVT. SENIOR SECONDARY SCHOOL",8210302,"XXXX8963",null,77426475656,"xyz  ajmer ,rajasthan 3333416",60000,"N","N","No",10,"None",0]
[5,"A",735,"2021-09-27","Mangli Prajapat",null,"Bhagchand Prajapat","Panchi Devi","F","2015-10-13",null,null,147,90,"OBC","Hindu",null,"GOVT. SENIOR SECONDARY SCHOOL",8210302,"XXXX1287",null,77426475657,"xyz  ajmer ,rajasthan 3333417",80000,"N","N","No",11,"None",0]
[5,"A",606,"2020-07-15","Mansha Prajapat",null,"Prakash Prajapat","Parvati","F","2014-12-02",null,null,147,90,"OBC","Hindu",null,"GOVT. SENIOR SECONDARY SCHOOL",8210302,"XXXX2805",null,77426475658,"xyz  ajmer ,rajasthan 3333418",50000,"N","N","No",12,"None",0]
[5,"A",676,"2021-06-22","Pawan Prajapat",null,"Basram Prajapat","Annu","M","2014-01-14",null,null,147,89,"OBC","Hindu",null,"GOVT. SENIOR SECONDARY SCHOOL",8210302,"XXXX2031",null,77426475659,"xyz  ajmer ,rajasthan 3333419",60000,"N","N","No",12,"None",0]
[5,"A",726,"2021-08-23","Pradeep Jat",null,"Sukhdev Jat","Samotra Devi","M","2015-05-28",null,null,147,90,"OBC","Hindu",null,"GOVT. SENIOR SECONDARY SCHOOL",8210302,"XXXX3317",null,77426475660,"xyz  ajmer ,rajasthan 3333420",80000,"N","N","No",11,"None",0]
[5,"A",722,"2021-08-13","Radhika choudhary",null,"Kailash Chand","Sunita","F","2016-05-20",null,null,147,88,"OBC","Hindu",null,"GOVT. SENIOR SECONDARY SCHOOL",8210302,"XXXX7216",null,77426475661,"xyz  ajmer ,rajasthan 3333421",60000,"N","N","No",10,"None",0]
[5,"A",731,"2021-09-23","Raju Prajapat",null,"Omprakash Prajapat","Sushila Devi","M","2016-07-01",null,null,147,90,"OBC","Hindu",null,"GOVT. SENIOR SECONDARY SCHOOL",8210302,"XXXX3430",null,77426475662,"xyz  ajmer ,rajasthan 3333422",60000,"N","N","No",10,"None",0]
[5,"A",975,"2025-12-22","Rajveer",null,"Golu Ram","Ramkani","M","2015-06-09",null,null,147,22,"OBC",null,null,"GOVT. SENIOR SECONDARY SCHOOL",8210302,null,null,77426475663,"xyz  ajmer ,rajasthan 3333423",null,"N","Y",null,11,null,1]
[5,"A",713,"2021-08-02","Rinku Nat",null,"Sonu","Gaytri","F","2013-04-20",null,null,147,86,"SC","Hindu",null,"GOVT. SENIOR SECONDARY SCHOOL",8210302,"XXXX0215",null,77426475664,"xyz  ajmer ,rajasthan 3333424",60000,"N","N","No",13,"None",0]
[5,"A",685,"2021-07-12","Samar Choudhary",null,"Mahendra Choudhary","Amrit Devi","M","2015-08-30",null,null,147,90,"OBC","Hindu",null,"GOVT. SENIOR SECONDARY SCHOOL",8210302,"XXXX7869",null,77426475665,"xyz  ajmer ,rajasthan 3333425",60000,"N","N","No",11,"None",1]
[5,"A",739,"2021-09-27","Sannu Jat",null,"Ranswarup","Bhagwati","F","2015-04-30",null,null,147,90,"OBC","Hindu",null,"GOVT. SENIOR SECONDARY SCHOOL",8210302,"XXXX3484",null,77426475666,"xyz  ajmer ,rajasthan 3333426",80000,"N","N","No",11,"None",0]
[5,"A",972,"2025-10-03","Sheru",null,"Chhotu","MEHRUN BANO","M","2015-12-02",null,null,147,50,"OBC","Muslim",null,"GOVT. SENIOR SECONDARY SCHOOL",8210302,"XXXX3071",null,77426475667,"xyz  ajmer ,rajasthan 3333427",48000,"N","N","Yes",11,"None",0]
[5,"A",746,"2021-10-22","Shivani",null,"Sukhpal Jat","Supyar Devi","F","2015-12-04",null,null,147,90,"OBC","Hindu",null,"GOVT. SENIOR SECONDARY SCHOOL",8210302,null,null,77426475668,"xyz  ajmer ,rajasthan 3333428",80000,"N","N","No",11,"None",0]
[5,"A",750,"2021-12-23","Tannu Bansali",null,"Kalu Ram","Sonu Devi","F","2015-10-11",null,null,147,90,"SC","Hindu",null,"GOVT. SENIOR SECONDARY SCHOOL",8210302,null,null,77426475669,"xyz  ajmer ,rajasthan 3333429",60000,"N","N","No",11,"None",0]
[5,"A",705,"2021-07-23","Vikash",null,"Pankaj Harijan","Savita","M","2015-07-14",null,null,147,89,"SC","Hindu",null,"GOVT. SENIOR SECONDARY SCHOOL",8210302,"XXXX7307",null,77426475670,"xyz  ajmer ,rajasthan 3333430",62000,"N","N","No",11,"None",0]
[5,"A",732,"2021-09-23","vikash jat",null,"Hariram jat","Guman Jat","M","2016-04-15",null,null,147,90,"OBC","Hindu",null,"GOVT. SENIOR SECONDARY SCHOOL",8210302,"XXXX3198",null,77426475671,"xyz  ajmer ,rajasthan 3333431",58000,"N","N","No",10,"None",0]
[5,"A",633,"2020-08-14","Vikram Prajapat",null,"Hardayal","Sona","M","2015-01-01",null,null,147,89,"OBC","Hindu",null,"GOVT. SENIOR SECONDARY SCHOOL",8210302,"XXXX8075",null,77426475672,"xyz  ajmer ,rajasthan 3333432",50000,"N","N","No",11,"None",0]
[6,"A",658,"2021-01-25","Anita",null,"Ramsingh","Neela Devi","F","2015-06-23",601,null,159,109,"OBC",null,null,"GOVT. SENIOR SECONDARY SCHOOL",8210302,"XXXX9026",null,77426475673,"xyz  ajmer ,rajasthan 3333433",80000,"N","N",null,11,"None",3]
[6,"A",654,"2021-01-25","Anjali",null,"Hanuman","Chaina","F","2015-01-16",602,null,159,125,"OBC",null,null,"GOVT. SENIOR SECONDARY SCHOOL",8210302,"XXXX7596",null,77426475674,"xyz  ajmer ,rajasthan 3333434",50000,"N","N",null,11,"None",0]
[6,"A",605,"2020-07-15","Annu",null,"Kalu Ram","Sonu","F","2014-01-27",603,null,159,133,"SC","Hindu",null,"GOVT. SENIOR SECONDARY SCHOOL",8210302,"XXXX4606",null,77426475675,"xyz  ajmer ,rajasthan 3333435",50000,"N","N","No",12,"None",0]
[6,"A",771,"2022-07-13","Anuska Choudhary",null,"Sanwar Lal Choudhary","Asha","F","2015-04-02",604,null,159,128,"OBC",null,null,"GOVT. SENIOR SECONDARY SCHOOL",8210302,null,null,77426475676,"xyz  ajmer ,rajasthan 3333436",null,"N","Y",null,11,null,0]
[6,"A",936,"2025-07-14","Arjun Bheel",null,"Gheesa Bheel","Sampat Devi","M","2013-11-10",605,null,159,86,"ST","Hindu",null,"GOVT. SENIOR SECONDARY SCHOOL",8210302,null,null,77426475677,"xyz  ajmer ,rajasthan 3333437",0,"N","N","No",13,"None",0]
[6,"A",632,"2020-08-14","Asha Prajapat",null,"Pankaj Kumar","Kanchan","F","2014-07-06",606,null,159,118,"OBC","Hindu",null,"GOVT. SENIOR SECONDARY SCHOOL",8210302,null,null,77426475678,"xyz  ajmer ,rajasthan 3333438",50000,"N","N","No",12,"None",0]
[6,"A",942,"2025-07-16","Ganesh Choudhary",null,"Ramraj Choudhary","Bhuri Devi","M","2013-06-07",607,null,159,132,"OBC","Hindu",null,"GOVT. SENIOR SECONDARY SCHOOL",8210302,null,null,77426475679,"xyz  ajmer ,rajasthan 3333439",0,"N","N","No",13,"None",3]
[6,"A",550,"2019-07-04","GORA PRAJAPAT",null,"HARADAYAL PRAJAPAT","SONA DEVI","F","2013-06-03",608,null,159,131,"OBC","Hindu",null,"GOVT. SENIOR SECONDARY SCHOOL",8210302,"XXXX2149","yioomio",77426475680,"xyz  ajmer ,rajasthan 3333440",50000,"N","N","No",13,"None",0]
[6,"A",634,"2020-08-14","Hemraj",null,"Ramnarayan","Sita","M","2014-09-21",609,null,159,131,"OBC","Hindu",null,"GOVT. SENIOR SECONDARY SCHOOL",8210302,"XXXX6786",null,77426475681,"xyz  ajmer ,rajasthan 3333441",50000,"N","N","No",12,"None",0]
[6,"A",639,"2020-08-18","Kanta Prajapat",null,"Dhulaya Prajapat","Manbhar Devi","F","2014-12-07",610,null,159,118,"OBC","Hindu",null,"GOVT. SENIOR SECONDARY SCHOOL",8210302,"XXXX9671",null,77426475682,"xyz  ajmer ,rajasthan 3333442",60000,"N","N","No",12,"None",0]
[6,"A",666,"2021-02-27","KARISHMA CHOUDHARY",null,"Gopiram Choudhary","Seema Devi","F","2013-01-01",611,null,159,120,"OBC",null,null,"GOVT. SENIOR SECONDARY SCHOOL",8210302,"XXXX3894",null,77426475683,"xyz  ajmer ,rajasthan 3333443",50000,"N","N",null,13,"None",3]
[6,"A",630,"2020-08-13","Krishna Prajapat",null,"Ramlal","Savitri","F","2014-10-12",612,null,159,134,"OBC","Hindu",null,"GOVT. SENIOR SECONDARY SCHOOL",8210302,"XXXX6046",null,77426475684,"xyz  ajmer ,rajasthan 3333444",50000,"N","N","No",12,"None",0]
[6,"A",830,"2023-07-11","Monika",null,"Ramprasad Jat","Radha Devi","F","2013-01-01",613,null,159,129,"OBC",null,null,"GOVT. SENIOR SECONDARY SCHOOL",8210302,"XXXX9793",null,77426475685,"xyz  ajmer ,rajasthan 3333445",null,"N","Y",null,13,null,0]
[6,"A",675,"2021-06-22","Monu Choudhary",null,"Kalu Ram","Santosh","M","2014-06-04",614,null,159,107,"OBC","Hindu",null,"GOVT. SENIOR SECONDARY SCHOOL",8210302,"XXXX3579",null,77426475686,"xyz  ajmer ,rajasthan 3333446",54000,"N","N","No",12,"None",3]
[6,"A",653,"2021-01-25","Nandram Jat",null,"Satyanarayan Jat","Seeta Devi","M","2014-02-08",615,null,159,125,"OBC",null,null,"GOVT. SENIOR SECONDARY SCHOOL",8210302,"XXXX6004",null,77426475687,"xyz  ajmer ,rajasthan 3333447",50000,"N","N",null,12,"None",0]
[6,"A",895,"2024-07-15","Nirmal Jat",null,"Hanuman Jat","Kamalesh","M","2014-03-21",616,null,159,131,"OBC",null,null,"GOVT. SENIOR SECONDARY SCHOOL",8210302,null,null,77426475688,"xyz  ajmer ,rajasthan 3333448",null,"N","Y",null,12,null,0]
[6,"A",608,"2020-07-20","Pooja Prajapat",null,"Laxman Prajapat","Kanchan Devi","F","2013-12-20",617,null,159,129,"OBC","Hindu",null,"GOVT. SENIOR SECONDARY SCHOOL",8210302,"XXXX9602",null,77426475689,"xyz  ajmer ,rajasthan 3333449",50000,"N","N","No",13,"None",0]
[6,"A",740,"2021-09-27","Pradeep Jat",null,"Govind Jat","Jivani Devi","M","2014-06-08",618,null,159,125,"OBC",null,null,"GOVT. SENIOR SECONDARY SCHOOL",8210302,"XXXX7095",null,77426475690,"xyz  ajmer ,rajasthan 3333450",50000,"N","N",null,12,"None",0]
[6,"A",629,"2020-08-13","Premchand Prajapat",null,"Kailash","Kanchan Devi","M","2015-07-17",619,null,159,105,"OBC",null,null,"GOVT. SENIOR SECONDARY SCHOOL",8210302,"XXXX1929",null,77426475691,"xyz  ajmer ,rajasthan 3333451",50000,"N","N",null,11,"None",0]
[6,"A",846,"2019-07-01","Priyanka Prajapat",null,"Pankaj Kumar","Kanchan","F","2014-05-07",620,null,159,98,"OBC","Hindu",null,"GOVT. SENIOR SECONDARY SCHOOL",8210302,"XXXX9326",null,77426475692,"xyz  ajmer ,rajasthan 3333452",0,"N","N","No",12,"None",0]
[6,"A",817,"2023-07-11","Radhika",null,"Arjun","Pooja","F","2012-08-28",621,null,159,109,"SC",null,null,"GOVT. SENIOR SECONDARY SCHOOL",8210302,"XXXX1558",null,77426475693,"xyz  ajmer ,rajasthan 3333453",null,"N","Y",null,14,null,0]
[6,"A",610,"2020-07-23","Rahul Bheel",null,"Chhotu Bheel","Sampati Devi","M","2015-01-01",622,null,159,117,"ST","Hindu",null,"GOVT. SENIOR SECONDARY SCHOOL",8210302,"XXXX6192",null,77426475694,"xyz  ajmer ,rajasthan 3333454",0,"N","N","No",11,"None",0]
[6,"A",628,"2020-08-13","Rahul Prajapat",null,"Kailash","Kanchan Devi","M","2013-07-04",623,null,159,125,"OBC","Hindu",null,"GOVT. SENIOR SECONDARY SCHOOL",8210302,"XXXX2297",null,77426475695,"xyz  ajmer ,rajasthan 3333455",80000,"N","N","No",13,"None",0]
[6,"A",635,"2020-08-14","Ranjeet Jat",null,"Om Prakash","Surgyan","M","2015-08-25",624,null,159,127,"OBC","Hindu",null,"GOVT. SENIOR SECONDARY SCHOOL",8210302,"XXXX7750",null,77426475696,"xyz  ajmer ,rajasthan 3333456",50000,"N","N","No",11,"None",0]
[6,"A",641,"2020-08-20","Rohit Prajapat",null,"Ram Singh Prajapat","Mamta Devi","M","2014-11-05",625,null,159,125,"OBC","Hindu",null,"GOVT. SENIOR SECONDARY SCHOOL",8210302,"XXXX6318",null,77426475697,"xyz  ajmer ,rajasthan 3333457",60000,"N","N","No",12,"None",0]
[6,"A",607,"2020-07-17","Sachin Bansali",null,"Ramraj Bansali","Manju Devi","M","2013-10-26",626,null,159,120,"SC","Hindu",null,"GOVT. SENIOR SECONDARY SCHOOL",8210302,"XXXX5094",null,77426475698,"xyz  ajmer ,rajasthan 3333458",50000,"N","N","No",13,"None",0]
[6,"A",621,"2020-08-10","Sagar",null,"Arjun","Pooja","M","2014-01-21",627,null,159,123,"SC","Hindu",null,"GOVT. SENIOR SECONDARY SCHOOL",8210302,"XXXX0870",null,77426475699,"xyz  ajmer ,rajasthan 3333459",60000,"N","N","No",12,"None",0]
[6,"A",956,"2025-07-26","Samina Bano",null,"Basir","Shanaj","F","2013-03-22",628,null,159,116,"OBC","Muslim",null,"GOVT. SENIOR SECONDARY SCHOOL",8210302,null,null,77426475700,"xyz  ajmer ,rajasthan 3333460",60000,"N","N","Yes",13,"None",0]
[6,"A",736,"2021-09-27","Sarita Prajapat",null,"Mukesh","Maina","F","2014-07-02",629,null,159,122,"OBC",null,null,"GOVT. SENIOR SECONDARY SCHOOL",8210302,"XXXX1852",null,77426475701,"xyz  ajmer ,rajasthan 3333461",80000,"N","N",null,12,"None",0]
[6,"A",613,"2020-07-31","Sunil Meghwanshi",null,"Seetaram Meghwanshi","Maya Devi","M","2013-06-29",630,null,159,124,"SC","Hindu",null,"GOVT. SENIOR SECONDARY SCHOOL",8210302,"XXXX6702",null,77426475702,"xyz  ajmer ,rajasthan 3333462",50000,"N","N","No",13,"None",0]
[6,"A",667,"2021-02-27","Surendra Prajapat",null,"Ramlal Prajapat","Rekha","M","2015-09-14",631,null,159,126,"OBC",null,null,"GOVT. SENIOR SECONDARY SCHOOL",8210302,"XXXX8278",null,77426475703,"xyz  ajmer ,rajasthan 3333463",80000,"N","N",null,11,"None",0]
[6,"A",612,"2020-07-27","Vikash Prajapat",null,"Prabhu Lal","Ramsuvar","M","2015-07-09",632,null,159,129,"OBC","Hindu",null,"GOVT. SENIOR SECONDARY SCHOOL",8210302,"XXXX0609",null,77426475704,"xyz  ajmer ,rajasthan 3333464",50000,"N","N","No",11,"None",0]
[7,"A",546,"2019-07-03","ADESH CHOUDHARY",null,"SARDAR CHOUDHARY","SURGYAN DEVI","M","2013-04-06",701,null,159,87,"OBC","Hindu",null,"GOVT. SENIOR SECONDARY SCHOOL",8210302,"XXXX4784","vnpvnjv",77426475705,"xyz  ajmer ,rajasthan 3333465",50000,"N","N","No",13,"None",0]
[7,"A",954,"2025-07-25","Anisha Choudhary",null,"Hathiram","Shammu","F","2014-09-16",702,null,159,112,"OBC","Hindu",null,"GOVT. SENIOR SECONDARY SCHOOL",8210302,null,null,77426475706,"xyz  ajmer ,rajasthan 3333466",55000,"N","N","No",12,"None",0]
[7,"A",953,"2025-07-23","Anjali",null,"Pradhan","Saroj Devi","F","2013-09-28",703,null,159,104,"OBC","Hindu",null,"GOVT. SENIOR SECONDARY SCHOOL",8210302,null,null,77426475707,"xyz  ajmer ,rajasthan 3333467",60000,"N","N","No",13,"None",3]
[7,"A",660,"2021-01-25","Anjali",null,"Ramsingh","Nila Devi","F","2012-09-26",704,null,159,106,"OBC","Hindu",null,"GOVT. SENIOR SECONDARY SCHOOL",8210302,"XXXX2925",null,77426475708,"xyz  ajmer ,rajasthan 3333468",80000,"N","N","No",14,"None",3]
[7,"A",659,"2021-01-25","Ankar Jat",null,"Dhanraj Jat","Kopan Devi","F","2013-02-12",705,null,159,105,"OBC",null,null,"GOVT. SENIOR SECONDARY SCHOOL",8210302,"XXXX2729",null,77426475709,"xyz  ajmer ,rajasthan 3333469",80000,"N","N",null,13,"None",3]
[7,"A",556,"2019-07-06","ANKIT JAT",null,"JAI SINGH JAT","NARBDA DEVI","M","2013-06-05",706,null,159,100,"OBC","Hindu",null,"GOVT. SENIOR SECONDARY SCHOOL",8210302,"XXXX9754","voocjwv",77426475710,"xyz  ajmer ,rajasthan 3333470",66000,"N","N","No",13,"None",0]
[7,"A",969,"2025-09-10","Balram Jat",null,"Satyanarayan Jat","Sita Devi","M","2013-01-13",707,null,159,79,"OBC",null,null,"GOVT. SENIOR SECONDARY SCHOOL",8210302,null,null,77426475711,"xyz  ajmer ,rajasthan 3333471",null,"N","Y",null,13,null,0]
[7,"A",458,"2018-06-23","DILIP CHOUDHARY",null,"PRADHAN CHOUDHARY","PARVATI DEVI","M","2013-02-12",708,null,159,111,"OBC","Hindu",null,"GOVT. SENIOR SECONDARY SCHOOL",8210302,"XXXX7043",null,77426475712,"xyz  ajmer ,rajasthan 3333472",60000,"N","N","No",13,"None",0]
[7,"A",603,"2019-12-05","Dinesh Prajapat",null,"Kailash Prajapat","Parwati","M","2014-03-13",709,null,159,105,"OBC","Hindu",null,"GOVT. SENIOR SECONDARY SCHOOL",8210302,"XXXX3547",null,77426475713,"xyz  ajmer ,rajasthan 3333473",60000,"N","N","No",12,"None",0]
[7,"A",908,"2024-07-25","Gyanwanti Devi Bheel",null,"Nathu Bheel","Surgyan","F","2014-01-01",710,null,159,103,"ST",null,null,"GOVT. SENIOR SECONDARY SCHOOL",8210302,null,null,77426475714,"xyz  ajmer ,rajasthan 3333474",0,"N","N",null,12,"None",4]
[7,"A",963,"2025-08-14","KHUSHI PRAJAPAT",null,"HANUMAN PRAJAPAT","CHAINA DEVI","F","2012-12-02",712,null,159,100,"OBC","Hindu",null,"GOVT. SENIOR SECONDARY SCHOOL",8210302,"XXXX6045","Yickowo",77426475715,"xyz  ajmer ,rajasthan 3333475",50000,"N","N","No",14,"None",0]
[7,"A",938,"2025-07-15","Khushi Prajapat",null,"Budhraj Prajapat","Sumitra Devi","F","2012-07-23",711,null,159,109,"OBC","Hindu",null,"GOVT. SENIOR SECONDARY SCHOOL",8210302,"XXXX1591",null,77426475716,"xyz  ajmer ,rajasthan 3333476",0,"N","N","No",14,"None",0]
[7,"A",560,"2019-07-08","KHUSHIRAM PRAJAPAT",null,"RAMLAL PRAJAPAT","SAVITRI DEVI","M","2012-09-07",713,null,159,112,"OBC","Hindu",null,"GOVT. SENIOR SECONDARY SCHOOL",8210302,"XXXX8807","yiiuaub",77426475717,"xyz  ajmer ,rajasthan 3333477",48000,"N","N","No",14,"None",0]
[7,"A",891,"2024-07-13","Kiran Devi Bheel",null,"Shaitan Bheel","Mathra Devi","F","2013-12-02",714,null,159,81,"ST","Hindu",null,"GOVT. SENIOR SECONDARY SCHOOL",8210302,"XXXX3421",null,77426475718,"xyz  ajmer ,rajasthan 3333478",0,"N","N","No",13,"None",4]
[7,"A",716,"2021-08-05","KOMAL CHOUDHARY",null,"DHANRAJ CHOUDHARY","MATHRA DEVI","F","2012-12-12",715,null,159,110,"OBC",null,null,"GOVT. SENIOR SECONDARY SCHOOL",8210302,"XXXX9829",null,77426475719,"xyz  ajmer ,rajasthan 3333479",80000,"N","N",null,14,"None",0]
[7,"A",593,"2019-08-02","Komal Jat",null,"Hemraj Jat","Ladi Devi","F","2013-10-08",716,null,159,98,"OBC","Hindu",null,"GOVT. SENIOR SECONDARY SCHOOL",8210302,"XXXX4062","yiakfos",77426475720,"xyz  ajmer ,rajasthan 3333480",50000,"N","N","No",13,"None",0]
[7,"A",530,"2018-07-31","LOKESH PRAJAPAT",null,"PARASA RAM PRAJAPAT","GANESHI DEVI","M","2012-11-05",717,null,159,100,"OBC","Hindu",null,"GOVT. SENIOR SECONDARY SCHOOL",8210302,"XXXX2433","VNHKZOV",77426475721,"xyz  ajmer ,rajasthan 3333481",30000,"N","N","No",14,"None",0]
[7,"A",454,"2018-06-20","MAHENDRA CHOUDHARY",null,"RAMDAYAL CHOUDHARY","SAMPAT DEVI","M","2012-11-29",718,null,159,92,"OBC","Hindu",null,"GOVT. SENIOR SECONDARY SCHOOL",8210302,"XXXX2525",null,77426475722,"xyz  ajmer ,rajasthan 3333482",65000,"N","N","No",14,"None",0]
[7,"A",544,"2019-07-02","MAHIPAL CHOUDHARY",null,"KANARAM CHOUDHARY","INDRA DEVI","M","2012-12-24",719,null,159,95,"OBC","Hindu",null,"GOVT. SENIOR SECONDARY SCHOOL",8210302,"XXXX2405","bagusis",77426475723,"xyz  ajmer ,rajasthan 3333483",50000,"N","N","No",14,"None",3]
[7,"A",888,"2024-07-10","Mamta Choudhary",null,"Kaluram Choudhary","Ganga Devi","F","2014-03-16",720,null,159,84,"OBC",null,null,"GOVT. SENIOR SECONDARY SCHOOL",8210302,"XXXX0277",null,77426475724,"xyz  ajmer ,rajasthan 3333484",0,"N","N",null,12,"None",3]
[7,"A",592,"2019-08-02","Mangal Jat",null,"Lalaram Jat","mathara devi","M","2013-11-26",721,null,159,93,"OBC","Hindu",null,"GOVT. SENIOR SECONDARY SCHOOL",8210302,"XXXX1947","wxwbjzh",77426475725,"xyz  ajmer ,rajasthan 3333485",40000,"N","N","No",13,"None",0]
[7,"A",598,"2019-08-22","Manisha",null,"Shankar Lal","Mamata Devi","F","2014-01-01",722,null,159,97,"OBC","Hindu",null,"GOVT. SENIOR SECONDARY SCHOOL",8210302,"XXXX4852",null,77426475726,"xyz  ajmer ,rajasthan 3333486",60000,"N","N","No",12,"None",0]
[7,"A",889,"2024-07-13","Manisha Devi Meghwanshi",null,"Rajendra Meghwanshi","Manju Devi","F","2013-11-18",723,null,159,88,"SC",null,null,"GOVT. SENIOR SECONDARY SCHOOL",8210302,"XXXX8467",null,77426475727,"xyz  ajmer ,rajasthan 3333487",0,"N","N",null,13,"None",3]
[7,"A",551,"2019-07-04","MANSA KUMHAR",null,"MAHAVEER KUMHAR","FOOLA DEVI","F","2013-07-06",724,null,159,97,"OBC","Hindu",null,"GOVT. SENIOR SECONDARY SCHOOL",8210302,"XXXX6763","vpgvgwm",77426475728,"xyz  ajmer ,rajasthan 3333488",36000,"N","N","No",13,"None",0]
[7,"A",547,"2019-07-03","MANSA KUMHAR",null,"SANWARA KUMHAR","SAMOTRA DEVI","F","2013-08-22",725,null,159,85,"OBC","Hindu",null,"GOVT. SENIOR SECONDARY SCHOOL",8210302,"XXXX2805",null,77426475729,"xyz  ajmer ,rajasthan 3333489",50000,"N","N","No",13,"None",0]
[7,"A",949,"2025-07-21","Mehram Jat",null,"Raymal Jat","Mathura Devi","M","2013-10-06",726,null,159,95,"OBC","Hindu",null,"GOVT. SENIOR SECONDARY SCHOOL",8210302,"XXXX2031","YKSOCSC",77426475730,"xyz  ajmer ,rajasthan 3333490",65000,"N","N","No",13,"None",1]
[7,"A",900,"2024-07-18","Mohammad Ikbal",null,"Chhotu","MEHRUN BANO","M","2013-05-16",727,null,159,91,"OBC","Muslim",null,"GOVT. SENIOR SECONDARY SCHOOL",8210302,"XXXX3975",null,77426475731,"xyz  ajmer ,rajasthan 3333491",0,"N","N","Yes",13,"None"]
[7,"A",572,"2019-07-15","MOHIT JAT",null,"PRADHAN JAT","MAMTA","M","2014-04-14",728,null,159,96,"OBC","Hindu",null,"GOVT. SENIOR SECONDARY SCHOOL",8210302,"XXXX9951","vgxgvbv",77426475732,"xyz  ajmer ,rajasthan 3333492",70000,"N","N","No",12,"None",0]
[7,"A",467,"2018-07-02","MOHIT MEGHWANSHI",null,"HANUMAN MEGHWANSHI","MAMTA DEVI","M","2012-10-28",729,null,159,94,"SC","Hindu",null,"GOVT. SENIOR SECONDARY SCHOOL",8210302,"XXXX9133","VPPGRGV",77426475733,"xyz  ajmer ,rajasthan 3333493",50000,"N","N","No",14,"None",0]
[7,"A",541,"2019-05-06","MONIKA CHOUDHARY",null,"MANGILAL CHOUDHARY","SHOBHAG DEVI","F","2013-02-06",730,null,159,96,"OBC","Hindu",null,"GOVT. SENIOR SECONDARY SCHOOL",8210302,"XXXX7526","ysgukmw",77426475734,"xyz  ajmer ,rajasthan 3333494",50000,"N","N","No",13,"None",0]
[7,"A",573,"2019-07-16","NARENDRA JAT",null,"KAILASH JAT","SAMPAT DEVI","M","2013-05-01",731,null,159,89,"OBC","Hindu",null,"GOVT. SENIOR SECONDARY SCHOOL",8210302,"XXXX4077","yksowoo",77426475735,"xyz  ajmer ,rajasthan 3333495",60000,"N","N","No",13,"None",0]
[7,"A",919,"2024-08-20","Neela Devi Bheel",null,"Raju Bheel","Sunita devi","F","2013-09-23",732,null,159,86,"ST",null,null,"GOVT. SENIOR SECONDARY SCHOOL",8210302,null,null,77426475736,"xyz  ajmer ,rajasthan 3333496",0,"N","N",null,13,"None",3]
[7,"A",558,"2019-07-06","OMPRAKASH KUMHAR",null,"PARBHU KUMHAR","SITA DEVI","M","2013-04-11",733,null,159,85,"SBC","Hindu",null,"GOVT. SENIOR SECONDARY SCHOOL",8210302,"XXXX6662","yigmffw",77426475737,"xyz  ajmer ,rajasthan 3333497",60000,"N","N","No",13,"None",0]
[7,"A",669,"2021-02-27","Pooja Jat",null,"Gopiram","Seema","F","2013-01-01",734,null,159,92,"OBC",null,null,"GOVT. SENIOR SECONDARY SCHOOL",8210302,"XXXX6155",null,77426475738,"xyz  ajmer ,rajasthan 3333498",80000,"N","N",null,13,"None",4]
[7,"A",540,"2019-05-06","PRADEEP JAT",null,"RAJESH JAT","SITA DEVI","M","2013-07-31",735,null,159,91,"OBC","Hindu",null,"GOVT. SENIOR SECONDARY SCHOOL",8210302,"XXXX4836","YIGBUDG",77426475739,"xyz  ajmer ,rajasthan 3333499",50000,"N","N","No",13,"None",0]
[7,"A",804,"2022-09-03","Priya",null,"Dharmichand","Kani Devi","F","2013-11-26",736,null,159,86,"OBC","Hindu",null,"GOVT. SENIOR SECONDARY SCHOOL",8210302,"XXXX3651",null,77426475740,"xyz  ajmer ,rajasthan 3333500",60000,"N","N","No",13,"None",0]
[7,"A",930,"2025-07-12","Priya",null,"Prakash Bhambhi","Reena Devi","F","2014-01-11",737,null,159,98,"SC","Hindu",null,"GOVT. SENIOR SECONDARY SCHOOL",8210302,null,null,77426475741,"xyz  ajmer ,rajasthan 3333501",48000,"N","N","No",12,"None",0]
[7,"A",711,"2021-07-31","Priyanka Jat",null,"Omprakash","Surgyan Devi","F","2012-06-01",738,null,159,97,"OBC","Hindu",null,"GOVT. SENIOR SECONDARY SCHOOL",8210302,"XXXX8768",null,77426475742,"xyz  ajmer ,rajasthan 3333502",80000,"N","N","No",14,"None",0]
[7,"A",646,"2020-10-16","Radhika",null,"Mahaveer Bhil","Mandraj","F","2012-01-01",739,null,159,45,"ST","Hindu",null,"GOVT. SENIOR SECONDARY SCHOOL",8210302,"XXXX6554",null,77426475743,"xyz  ajmer ,rajasthan 3333503",50000,"N","N","No",14,"None",0]
[7,"A",460,"2018-06-25","RADHIKA JAT",null,"MISHRI LAL JAT","KALI DEVI","F","2012-10-16",740,null,159,100,"OBC","Hindu",null,"GOVT. SENIOR SECONDARY SCHOOL",8210302,"XXXX0958",null,77426475744,"xyz  ajmer ,rajasthan 3333504",60000,"N","N","No",14,"None",0]
[7,"A",886,"2024-07-06","Rahul Choudhary",null,"Ramraj Choudhary","Bhuri Devi","M","2012-01-01",741,null,159,94,"OBC",null,null,"GOVT. SENIOR SECONDARY SCHOOL",8210302,"XXXX2236",null,77426475745,"xyz  ajmer ,rajasthan 3333505",0,"N","N",null,14,"None",4]
[7,"A",873,"2018-07-09","Ranjeet",null,"Mangal Chand Jat","Kanta Devi","M","2013-04-17",742,null,159,94,"OBC","Hindu",null,"GOVT. SENIOR SECONDARY SCHOOL",8210302,"XXXX4517",null,77426475746,"xyz  ajmer ,rajasthan 3333506",60000,"N","N","No",13,"None",3]
[7,"A",701,"2021-07-20","RITIKA CHOUDHARY",null,"Hansraj Choudhary","Manraj","F","2012-04-23",743,null,159,92,"OBC","Hindu",null,"GOVT. SENIOR SECONDARY SCHOOL",8210302,null,null,77426475747,"xyz  ajmer ,rajasthan 3333507",80000,"N","N","No",14,"None",4]
[7,"A",664,"2021-02-26","Ritika Gurjar",null,"Mangal Chand Gurjar","Nepal Devi","F","2013-11-23",744,null,159,86,"SBC",null,null,"GOVT. SENIOR SECONDARY SCHOOL",8210302,"XXXX8662",null,77426475748,"xyz  ajmer ,rajasthan 3333508",60000,"N","N",null,13,"None",3]
[7,"A",903,"2024-07-19","Salma Bano",null,"Chhotu","MEHRUN BANO","F","2012-04-27",745,null,159,84,"OBC","Muslim",null,"GOVT. SENIOR SECONDARY SCHOOL",8210302,"XXXX6436",null,77426475749,"xyz  ajmer ,rajasthan 3333509",0,"N","N","Yes",14,"None"]
[7,"A",898,"2024-07-16","Sannu Bheel",null,"Pappu Bheel","Maina Devi","M","2014-01-01",746,null,159,81,"ST",null,null,"GOVT. SENIOR SECONDARY SCHOOL",8210302,"XXXX6720",null,77426475750,"xyz  ajmer ,rajasthan 3333510",0,"N","N",null,12,"None",4]
[7,"A",456,"2018-06-21","SEEMA PRAJAPAT",null,"GANESH PRAJAPAT","ASHA DEVI","F","2012-06-26",747,null,159,100,"OBC","Hindu",null,"GOVT. SENIOR SECONDARY SCHOOL",8210302,"XXXX3718","YIAYYKW",77426475751,"xyz  ajmer ,rajasthan 3333511",50000,"N","N","No",14,"None",0]
[7,"A",704,"2021-07-22","Sonika Jat",null,"Prabhu Jat","Surma Devi","F","2013-02-22",748,null,159,96,"OBC","Hindu",null,"GOVT. SENIOR SECONDARY SCHOOL",8210302,"XXXX3733",null,77426475752,"xyz  ajmer ,rajasthan 3333512",70000,"N","N","No",13,"None",3]
[7,"A",964,"2025-08-14","SUMAN JAT",null,"BHAIRU LAL JAT","NYALI DEVI","F","2014-02-10",749,null,159,82,"OBC",null,null,"GOVT. SENIOR SECONDARY SCHOOL",8210302,null,null,77426475753,"xyz  ajmer ,rajasthan 3333513",0,"N","N",null,12,"None",1]
[7,"A",887,"2024-07-06","Sunil Choudhary",null,"Parmeshwar Choudhary","Geeta Devi","M","2012-10-13",750,null,159,88,"OBC",null,null,"GOVT. SENIOR SECONDARY SCHOOL",8210302,"XXXX3968",null,77426475754,"xyz  ajmer ,rajasthan 3333514",0,"N","N",null,14,"None",3]
[7,"A",459,"2018-06-25","SUNIL LUHAR",null,"RAMKARAN LUHAR","INDRA DEVI","M","2011-07-03",751,null,159,94,"SBC","Hindu",null,"GOVT. SENIOR SECONDARY SCHOOL",8210302,"XXXX1817","YUEWBWK",77426475755,"xyz  ajmer ,rajasthan 3333515",45000,"N","N","No",15,"NCC",0]
[7,"A",465,"2018-06-25","SUNITA BANSALI",null,"RAMRAJ BANSALI","MANJU DEVI","F","2012-05-18",752,null,159,94,"SC","Hindu",null,"GOVT. SENIOR SECONDARY SCHOOL",8210302,"XXXX1389",null,77426475756,"xyz  ajmer ,rajasthan 3333516",40000,"N","N","No",14,"None",0]
[7,"A",464,"2018-06-25","SUNITA JAT",null,"RAMNIWAS JAT","SEEMA DEVI","F","2012-07-13",753,null,159,84,"OBC","Hindu",null,"GOVT. SENIOR SECONDARY SCHOOL",8210302,"XXXX3440",null,77426475757,"xyz  ajmer ,rajasthan 3333517",60000,"N","N","No",14,"None",0]
[7,"A",534,"2018-07-31","SUNITA PRAJAPAT",null,"PRAKASH PRAJAPAT","PARWATI DEVI","F","2013-01-24",754,null,159,96,"OBC","Hindu",null,"GOVT. SENIOR SECONDARY SCHOOL",8210302,"XXXX4995",null,77426475758,"xyz  ajmer ,rajasthan 3333518",38000,"N","N","No",13,"None",0]
[7,"A",642,"2020-08-21","Suraj Prajapat",null,"Ram Singh Prajapat","Mamta Devi","M","2012-08-28",755,null,159,92,"OBC","Hindu",null,"GOVT. SENIOR SECONDARY SCHOOL",8210302,"XXXX5505",null,77426475759,"xyz  ajmer ,rajasthan 3333519",60000,"N","N","No",14,"None",0]
[7,"A",463,"2018-06-25","TEJU PRAJAPAT",null,"DHOOLA RAM PRAJAPAT","MANBHAR DEVI","M","2012-09-05",756,null,159,90,"OBC","Hindu",null,"GOVT. SENIOR SECONDARY SCHOOL",8210302,"XXXX6284","YGDGOCG",77426475760,"xyz  ajmer ,rajasthan 3333520",50000,"N","N","No",14,"None",0]
[7,"A",627,"2020-08-13","Vikas Choudhary",null,"Gopal","Mandraj","M","2014-01-13",757,null,159,87,"OBC",null,null,"GOVT. SENIOR SECONDARY SCHOOL",8210302,null,null,77426475761,"xyz  ajmer ,rajasthan 3333521",50000,"N","N",null,12,"None",0]
[7,"A",545,"2019-07-02","VISHNU CHOUDHARY",null,"HATHI RAM","GUMAN DEVI","M","2014-01-16",758,null,159,99,"OBC","Hindu",null,"GOVT. SENIOR SECONDARY SCHOOL",8210302,"XXXX9856","vkgcwwr",77426475762,"xyz  ajmer ,rajasthan 3333522",50000,"N","N","No",12,"None",0]
[8,"A",502,"2018-07-11","AASHU CHOUDHARY",null,"HARIRAM CHOUDHARY","RAMSWARI DEVI","F","2013-02-22",801,null,148,146,"OBC","Hindu",null,"GOVT. SENIOR SECONDARY SCHOOL",8210302,"XXXX1574","YIWSWQO",77426475763,"xyz  ajmer ,rajasthan 3333523",65000,"N","N","No",13,"None",0]
[8,"A",955,"2025-07-25","Aasid",null,"Bashir","Shanaj","M","2012-05-30",802,null,148,124,"OBC","Muslim",null,"GOVT. SENIOR SECONDARY SCHOOL",8210302,null,null,77426475764,"xyz  ajmer ,rajasthan 3333524",60000,"N","N","Yes",14,"None",0]
[8,"A",818,"2023-07-11","Abhishek Choudhary",null,"Bheru Lal Choudhary","Surgyan Devi","M","2013-08-07",803,null,148,142,"OBC",null,null,"GOVT. SENIOR SECONDARY SCHOOL",8210302,"XXXX8858",null,77426475765,"xyz  ajmer ,rajasthan 3333525",0,"N","N",null,13,"None",3]
[8,"A",537,"2018-07-31","ANJU JAT",null,"HATHI RAM","SAMBHU DEVI","F","2012-09-18",804,null,148,147,"OBC","Hindu",null,"GOVT. SENIOR SECONDARY SCHOOL",8210302,"XXXX9285","VGZZVWT",77426475766,"xyz  ajmer ,rajasthan 3333526",50000,"N","N","No",14,"None",0]
[8,"A",745,"2021-10-22","ASHAD ALI",null,"SHAHBUDDIN KURESHI","MADEENA BANO","M","2013-02-23",805,null,148,145,"OBC",null,null,"GOVT. SENIOR SECONDARY SCHOOL",8210302,"XXXX7023",null,77426475767,"xyz  ajmer ,rajasthan 3333527",80000,"N","N",null,13,"None",0]
[8,"A",601,"2019-08-22","ASHARAM PRAJAPAT",null,"RAMSUKH PRAJAPAT","NORATI DEVI","M","2012-08-16",806,null,148,140,"OBC",null,null,"GOVT. SENIOR SECONDARY SCHOOL",8210302,"XXXX0509",null,77426475768,"xyz  ajmer ,rajasthan 3333528",48000,"N","N",null,14,"None",0]
[8,"A",462,"2018-06-25","BALRAM PRAJAPAT",null,"OMPRAKASH PRAJAPAT","SUSHILA DEVI","M","2012-11-01",807,null,148,147,"OBC","Hindu",null,"GOVT. SENIOR SECONDARY SCHOOL",8210302,"XXXX5262","YIYUUKC",77426475769,"xyz  ajmer ,rajasthan 3333529",50000,"N","N","No",14,"None",0]
[8,"A",858,"2018-07-02","CHARAN",null,"BRHMANAND JAT","BADAM DEVI","M","2012-10-30",808,null,148,138,"OBC","Hindu",null,"GOVT. SENIOR SECONDARY SCHOOL",8210302,"XXXX8555",null,77426475770,"xyz  ajmer ,rajasthan 3333530",0,"N","N","No",14,"None",3]
[8,"A",594,"2019-08-02","DINESH MEGHAWANSHI",null,"SHAUKIN MEGHAWANSHI","KANCHAN DEVI","M","2012-05-20",809,null,148,129,"SC","Hindu",null,"GOVT. SENIOR SECONDARY SCHOOL",8210302,"XXXX1735","vtgggon",77426475771,"xyz  ajmer ,rajasthan 3333531",50000,"N","N","No",14,"None",4]
[8,"A",503,"2018-07-11","INKAR JAT",null,"KANARAM JAT","NORATI DEVI","F","2013-01-01",810,null,148,147,"OBC","Hindu",null,"GOVT. SENIOR SECONDARY SCHOOL",8210302,"XXXX9564","YKSOWGK",77426475772,"xyz  ajmer ,rajasthan 3333532",65000,"N","N","No",13,"None",0]
[8,"A",466,"2018-07-02","JEETU RAIDAS",null,"NARESH RAIDAS","POOJA DEVI","M","2013-06-09",811,null,148,145,"SC","Hindu",null,"GOVT. SENIOR SECONDARY SCHOOL",8210302,"XXXX9924","YBCWBQC",77426475773,"xyz  ajmer ,rajasthan 3333533",50000,"N","N","No",13,"None",0]
[8,"A",582,"2019-07-27","KALPNA HARIJAN",null,"PINKU HARIJAN","SAVITA","F","2012-08-10",812,null,148,142,"SC","Hindu",null,"GOVT. SENIOR SECONDARY SCHOOL",8210302,"XXXX4711","yimymbc",77426475774,"xyz  ajmer ,rajasthan 3333534",60000,"N","N","No",14,"None",0]
[8,"A",868,"2018-07-02","Kaushlya",null,"DINESH JAT","CHANTA DEVI","F","2013-09-24",813,null,148,145,"OBC","Hindu",null,"GOVT. SENIOR SECONDARY SCHOOL",8210302,"XXXX7547",null,77426475775,"xyz  ajmer ,rajasthan 3333535",0,"N","N","No",13,"None",3]
[8,"A",859,"2018-07-02","KHUSHBU",null,"SATYANARAYAN NAYAK","INDRA DEVI","F","2013-09-05",814,null,148,146,"SC","Hindu",null,"GOVT. SENIOR SECONDARY SCHOOL",8210302,null,null,77426475776,"xyz  ajmer ,rajasthan 3333536",0,"N","N","No",13,"None",3]
[8,"A",820,"2023-07-11","Komal Devi Choudhary",null,"Basram Choudhary","Nyali Devi","F","2013-07-10",815,null,148,144,"OBC","Hindu",null,"GOVT. SENIOR SECONDARY SCHOOL",8210302,null,null,77426475777,"xyz  ajmer ,rajasthan 3333537",50000,"N","N","No",13,"None",0]
[8,"A",504,"2018-07-11","KOMAL JAT",null,"GOPAL JAT","SURGYAN DEVI","F","2012-09-08",816,null,148,146,"OBC","Hindu",null,"GOVT. SENIOR SECONDARY SCHOOL",8210302,"XXXX5253",null,77426475778,"xyz  ajmer ,rajasthan 3333538",36000,"N","N","No",14,"None",0]
[8,"A",536,"2018-07-31","KOMAL JAT",null,"SHANKAR LAL CHOUDHARY","MAMTA DEVI","F","2012-11-16",817,null,148,148,"OBC","Hindu",null,"GOVT. SENIOR SECONDARY SCHOOL",8210302,"XXXX9470","VGWGCXJ",77426475779,"xyz  ajmer ,rajasthan 3333539",40000,"N","N","No",14,"None",0]
[8,"A",826,"2018-07-07","LAKHIRAM MEGHWANSHI",null,"HEMRAJ","MAYA DEVI","M","2012-10-12",818,null,148,133,"SC","Hindu",null,"GOVT. SENIOR SECONDARY SCHOOL",8210302,"XXXX4685",null,77426475780,"xyz  ajmer ,rajasthan 3333540",0,"N","N","No",14,"None",4]
[8,"A",933,"2025-07-11","Manish Prajapat",null,"Ramlal Prajapat","Rekha Devi","M","2013-10-14",819,null,148,137,"OBC","Hindu",null,"GOVT. SENIOR SECONDARY SCHOOL",8210302,"XXXX9226","VNHVVNV",77426475781,"xyz  ajmer ,rajasthan 3333541",80000,"N","N","No",13,"None",0]
[8,"A",665,"2021-02-26","MANU",null,"CHHOTU","SALMA","M","2010-01-01",820,null,148,139,"OBC",null,null,"GOVT. SENIOR SECONDARY SCHOOL",8210302,"XXXX4219",null,77426475782,"xyz  ajmer ,rajasthan 3333542",60000,"N","N",null,16,"None",0]
[8,"A",703,"2021-07-22","MONIKA JAT",null,"PRABHU JAT","SURMA DEVI","F","2010-08-06",821,null,148,144,"OBC","Hindu",null,"GOVT. SENIOR SECONDARY SCHOOL",8210302,"XXXX6235",null,77426475783,"xyz  ajmer ,rajasthan 3333543",70000,"N","N","No",16,"None",3]
[8,"A",950,"2025-07-21","NARAJ CHOUDHARY",null,"PARMESHWAR","Amari Devi","F","2011-06-07",822,null,148,128,"OBC","Hindu",null,"GOVT. SENIOR SECONDARY SCHOOL",8210302,"XXXX2961","WFMUYUO",77426475784,"xyz  ajmer ,rajasthan 3333544",40000,"N","N","No",15,"None",3]
[8,"A",848,"2023-07-19","Parina",null,"Sattar","Mafiya bano","F","2011-12-15",823,null,148,143,"OBC","Muslim",null,"GOVT. SENIOR SECONDARY SCHOOL",8210302,"XXXX0152",null,77426475785,"xyz  ajmer ,rajasthan 3333545",0,"N","N","Yes",15,"None"]
[8,"A",869,"2018-07-02","PAYAL",null,"SHAITAN GURJAR","LADA DEVI","F","2013-01-28",824,null,148,139,"SBC","Hindu",null,"GOVT. SENIOR SECONDARY SCHOOL",8210302,"XXXX6223",null,77426475786,"xyz  ajmer ,rajasthan 3333546",60000,"N","N","No",13,"None",3]
[8,"A",847,"2018-07-10","PINKY DEVI CHOUDHARY",null,"KANARAM CHOUDHARY","MANBHAR DEVI","F","2013-08-24",825,null,148,142,"OBC","Hindu",null,"GOVT. SENIOR SECONDARY SCHOOL",8210302,"XXXX7685",null,77426475787,"xyz  ajmer ,rajasthan 3333547",0,"N","N","No",13,"None",3]
[8,"A",870,"2021-09-12","POOJA JAT",null,"PRADHAN JAT","SURMA DEVI","F","2010-05-19",826,null,148,144,"OBC","Hindu",null,"GOVT. SENIOR SECONDARY SCHOOL",8210302,"XXXX3086",null,77426475788,"xyz  ajmer ,rajasthan 3333548",63000,"N","N","No",16,"None",3]
[8,"A",935,"2025-07-12","Priyanka Prajapat",null,"Mahaveer Prajapat","Foola Devi","F","2013-06-10",827,null,148,133,"OBC","Hindu",null,"GOVT. SENIOR SECONDARY SCHOOL",8210302,"XXXX7360",null,77426475789,"xyz  ajmer ,rajasthan 3333549",45000,"N","N","No",13,"None",0]
[8,"A",461,"2018-06-25","RINKU PRAJAPAT",null,"OMPRAKASH PRAJAPAT","SUSHILA DEVI","F","2010-12-01",828,null,148,142,"OBC","Hindu",null,"GOVT. SENIOR SECONDARY SCHOOL",8210302,"XXXX5194","YIYUUKC",77426475790,"xyz  ajmer ,rajasthan 3333550",50000,"N","N","No",16,"None",0]
[8,"A",958,"2025-07-29","Rohit Meghwanshi",null,"Prahlad Meghwanshi","Santra","M","2011-08-25",829,null,148,123,"SC","Hindu",null,"GOVT. SENIOR SECONDARY SCHOOL",8210302,"XXXX9199","VGVJXT",77426475791,"xyz  ajmer ,rajasthan 3333551",40000,"N","N","No",15,"None",0]
[8,"A",823,"2018-06-26","SANOJ DEVI BHEEL",null,"SHANKAR LAL BHEEL","MANJU DEVI BHEEL","F","2013-04-12",830,null,148,143,"ST","Hindu",null,"GOVT. SENIOR SECONDARY SCHOOL",8210302,"XXXX8658",null,77426475792,"xyz  ajmer ,rajasthan 3333552",0,"N","N","No",13,"None",4]
[8,"A",836,"2018-07-07","SUMAN JAT","Late","BHAG CHAND JAT","MEERA JAT","F","2013-11-27",831,null,148,148,"OBC","Hindu",null,"GOVT. SENIOR SECONDARY SCHOOL",8210302,"XXXX5317",null,77426475793,"xyz  ajmer ,rajasthan 3333553",36000,"N","N","No",13,"None",3]
[8,"A",455,"2018-06-20","SUMAN JAT",null,"HATHI RAM JAT","GUMAN","F","2012-10-19",832,null,148,141,"OBC","Hindu",null,"GOVT. SENIOR SECONDARY SCHOOL",8210302,"XXXX4639","VKGCWWR",77426475794,"xyz  ajmer ,rajasthan 3333554",65000,"N","N","No",14,"None",0]
[8,"A",447,"2017-07-29","SUMAN PRAJAPAT",null,"PRAKASH PRAJAPAT","PARVATI DEVI","F","2011-07-14",833,null,148,144,"OBC","Hindu",null,"GOVT. SENIOR SECONDARY SCHOOL",8210302,"XXXX3430",null,77426475795,"xyz  ajmer ,rajasthan 3333555",60000,"N","N","No",15,"None",0]
[8,"A",860,"2018-07-02","SURENDAR",null,"SHAITAN JAT","GAMALA","M","2013-09-24",834,null,148,145,"OBC","Hindu",null,"GOVT. SENIOR SECONDARY SCHOOL",8210302,"XXXX4953",null,77426475796,"xyz  ajmer ,rajasthan 3333556",36000,"N","N","No",13,"None",3]
[8,"A",974,"2025-10-25","VIKAS CHOUDHARY",null,"RAMRATAN CHOUDHARY","SITA CHOUDAHRY","M","2013-01-30",835,null,148,53,"OBC","Hindu",null,"GOVT. SENIOR SECONDARY SCHOOL",8210302,null,null,77426475797,"xyz  ajmer ,rajasthan 3333557",0,"N","N","No",13,"None",3]
[9,"A",916,"2024-08-14","Amar Singh Bheel",null,"Premchand Bheel","Nathi Devi","M","2011-08-15",901,null,161,102,"ST","Hindu",null,"GOVT. SENIOR SECONDARY SCHOOL",8210302,null,null,77426475798,"xyz  ajmer ,rajasthan 3333558",55000,"N","N","No",15,"None",4]
[9,"A",401,"2017-07-04","ANITA PRAJAPAT",null,"BHAGCHAND PRAJAPAT","JETHI DEVI","F","2011-06-20",902,null,161,142,"OBC","Hindu",null,"GOVT. SENIOR SECONDARY SCHOOL",8210302,"XXXX6924",null,77426475799,"xyz  ajmer ,rajasthan 3333559",30000,"N","N","No",15,"None",0]
[9,"A",497,"2018-07-11","DAMODAR JAT",null,"KAILASH CHAND JAT","SAMPAT DEVI","M","2009-01-01",903,null,161,108,"OBC","Hindu",null,"GOVT. SENIOR SECONDARY SCHOOL",8210302,"XXXX5630","YKSOWOO",77426475800,"xyz  ajmer ,rajasthan 3333560",60000,"N","N","No",17,"None",1]
[9,"A",864,"2023-08-10","Deepak Vaishnav",null,"Satyanarayan Vaishnav","Neraj","M","2010-10-08",904,null,161,59,"OBC","Hindu",null,"GOVT. SENIOR SECONDARY SCHOOL",8210302,"XXXX0731",null,77426475801,"xyz  ajmer ,rajasthan 3333561",60000,"N","N","No",16,"None",0]
[9,"A",328,"2016-06-30","GANESH PRAJAPAT",null,"DHOOLA RAM PRAJAPAT","MANBHAR DEVI","M","2010-01-09",905,null,161,145,"OBC","Hindu",null,"GOVT. SENIOR SECONDARY SCHOOL",8210302,"XXXX8427","YGDGOCG",77426475802,"xyz  ajmer ,rajasthan 3333562",48000,"N","N","No",16,"None",0]
[9,"A",751,"2021-12-04","HANSA PRAJAPAT",null,"RAMSUKH PRAJAPAT","NORTI DEVI","F","2010-03-18",906,null,161,142,"OBC","Hindu",null,"GOVT. SENIOR SECONDARY SCHOOL",8210302,"XXXX8961",null,77426475803,"xyz  ajmer ,rajasthan 3333563",60000,"N","N","No",16,"None",0]
[9,"A",927,"2025-07-09","JEEVRAJ BHEEL",null,"PANCHU BHEEL","RAMESHWARI DEVI","M","2011-05-15",907,null,161,133,"ST",null,null,"GOVT. SENIOR SECONDARY SCHOOL",8210302,"XXXX2705",null,77426475804,"xyz  ajmer ,rajasthan 3333564",40000,"N","N",null,15,"None",0]
[9,"A",795,"2022-07-27","KAMLESH JAT",null,"SHYONARAYAN JAT","NERAJ JAT","F","2010-09-04",908,null,161,128,"OBC","Hindu",null,"GOVT. SENIOR SECONDARY SCHOOL",8210302,"XXXX7335",null,77426475805,"xyz  ajmer ,rajasthan 3333565",80000,"N","N","No",16,"None",0]
[9,"A",892,"2024-07-15","KAVITA MEGHWANSHI",null,"TEJU RAM","KALI DEVI","F","2012-07-30",909,null,161,121,"SC","Hindu",null,"GOVT. SENIOR SECONDARY SCHOOL",8210302,"XXXX6436",null,77426475806,"xyz  ajmer ,rajasthan 3333566",78000,"N","N","No",14,"None",4]
[9,"A",778,"2017-07-15","KHUSHBU DEVI BHEEL",null,"RAJU BHEEL","SUNITA DEVI","F","2012-05-15",910,null,161,107,"ST","Hindu",null,"GOVT. SENIOR SECONDARY SCHOOL",8210302,"XXXX3296",null,77426475807,"xyz  ajmer ,rajasthan 3333567",0,"N","N","No",14,"None",4]
[9,"A",403,"2017-07-04","KHUSHI RAM JAT",null,"SUKHPAL JAT","NARAJ DEVI","M","2011-06-10",911,null,161,143,"OBC","Hindu",null,"GOVT. SENIOR SECONDARY SCHOOL",8210302,"XXXX9086","VNPVNGP",77426475808,"xyz  ajmer ,rajasthan 3333568",40000,"N","N","No",15,"None",0]
[9,"A",850,"2023-07-19","KIRAN CHOUDHARY",null,"SARDAR CHOUDHARY","SURGYAN DEVI","F","2010-07-05",912,null,161,115,"OBC","Hindu",null,"GOVT. SENIOR SECONDARY SCHOOL",8210302,"XXXX5323","VNPVNJV",77426475809,"xyz  ajmer ,rajasthan 3333569",40000,"N","N","No",16,"None",0]
[9,"A",775,"2017-07-15","KISMAT DEVI BHEEL",null,"SHAITAN BHEEL","MATHRA DEVI","F","2012-03-20",913,null,161,96,"ST","Hindu",null,"GOVT. SENIOR SECONDARY SCHOOL",8210302,"XXXX8723",null,77426475810,"xyz  ajmer ,rajasthan 3333570",0,"N","N","No",14,"None",4]
[9,"A",790,"2022-07-22","KOMAL",null,"PARMESHWAR","PREM DEVI","F","2011-09-10",914,null,161,127,"OBC","Hindu",null,"GOVT. SENIOR SECONDARY SCHOOL",8210302,"XXXX5060",null,77426475811,"xyz  ajmer ,rajasthan 3333571",50000,"N","N","No",15,"None",3]
[9,"A",792,"2022-07-22","KOMAL",null,"SANWAR LAL","NERAJ","F","2011-10-22",915,null,161,79,"OBC","Hindu",null,"GOVT. SENIOR SECONDARY SCHOOL",8210302,"XXXX9655",null,77426475812,"xyz  ajmer ,rajasthan 3333572",50000,"N","N","No",15,"None",3]
[9,"A",583,"2019-07-27","KRISHNA HARIJAN",null,"PANKAJ HARIJAN","SAVITA","M","2011-05-15",916,null,161,79,"SC","Hindu",null,"GOVT. SENIOR SECONDARY SCHOOL",8210302,"XXXX6713","yimymbc",77426475813,"xyz  ajmer ,rajasthan 3333573",60000,"N","N","No",15,"None",0]
[9,"A",670,"2021-03-17","Lokesh",null,"Basram","Annu","M","2011-01-26",917,null,161,133,"OBC","Hindu",null,"GOVT. SENIOR SECONDARY SCHOOL",8210302,"XXXX7705",null,77426475814,"xyz  ajmer ,rajasthan 3333574",82000,"N","N","No",15,"None",0]
[9,"A",404,"2017-07-04","LOKESH PRAJAPAT",null,"KAILASH PRAJAPAT","RADHA DEVI","M","2011-01-01",918,null,161,149,"OBC","Hindu",null,"GOVT. SENIOR SECONDARY SCHOOL",8210302,"XXXX3700","YIMYOEC",77426475815,"xyz  ajmer ,rajasthan 3333575",40000,"N","N","No",15,"None",0]
[9,"A",638,"2020-08-14","Mahendra",null,"Ramesh","Shana","M","2011-01-01",919,null,161,136,"OBC","Hindu",null,"GOVT. SENIOR SECONDARY SCHOOL",8210302,"XXXX6268",null,77426475816,"xyz  ajmer ,rajasthan 3333576",50000,"N","N","No",15,"None",0]
[9,"A",967,"2025-08-18","Mandroop Choudhary",null,"Jaishing Choudhary","Smt Surgyan Devi","M","2012-07-01",920,null,161,63,"OBC","Hindu",null,"GOVT. SENIOR SECONDARY SCHOOL",8210302,"XXXX8279","VBVRBWP",77426475817,"xyz  ajmer ,rajasthan 3333577",40000,"N","N","No",14,"None",1]
[9,"A",918,"2024-08-20","MAYA DEVI BHEEL",null,"FATEHRAM BHEEL","PUSI DEVI BHEEL","F","2012-01-01",921,null,161,116,"ST","Hindu",null,"GOVT. SENIOR SECONDARY SCHOOL",8210302,"XXXX2764",null,77426475818,"xyz  ajmer ,rajasthan 3333578",80000,"N","N","No",14,"None",1]
[9,"A",574,"2019-07-24","NEELU CHOUDHARY",null,"RAMCHANDRA JAT","MAYA DEVI","F","2012-01-01",922,null,161,138,"OBC",null,null,"GOVT. SENIOR SECONDARY SCHOOL",8210302,"XXXX7703",null,77426475819,"xyz  ajmer ,rajasthan 3333579",35000,"N","N",null,14,"None",0]
[9,"A",897,"2024-07-16","Neetu Prajapat",null,"Ramlal Prajapat","Rekha Devi","F","2011-01-01",923,null,161,150,"OBC","Hindu",null,"GOVT. SENIOR SECONDARY SCHOOL",8210302,"XXXX3752","VNHVVNV",77426475820,"xyz  ajmer ,rajasthan 3333580",80000,"N","N","No",15,"None",0]
[9,"A",890,"2024-07-13","NISHA JAT",null,"KARTAR JAT","GYARSI DEVI","F","2011-07-01",924,null,161,121,"OBC","Hindu",null,"GOVT. SENIOR SECONDARY SCHOOL",8210302,"XXXX0690","VGWGNVR",77426475821,"xyz  ajmer ,rajasthan 3333581",50000,"N","N","No",15,"None",3]
[9,"A",444,"2017-07-28","PAWAN PRAJAPAT",null,"PARASRAM PRAJAPAT","GANESHI DEVI","M","2010-03-09",925,null,161,138,"OBC","Hindu",null,"GOVT. SENIOR SECONDARY SCHOOL",8210302,"XXXX1903",null,77426475822,"xyz  ajmer ,rajasthan 3333582",60000,"N","N","No",16,"None",0]
[9,"A",405,"2017-07-04","POOJA PRAJAPAT",null,"SANWARA PRAJAPAT","SUMITRA DEVI","F","2010-11-15",926,null,161,125,"OBC","Hindu",null,"GOVT. SENIOR SECONDARY SCHOOL",8210302,"XXXX7372",null,77426475823,"xyz  ajmer ,rajasthan 3333583",58000,"N","N","No",16,"None",0]
[9,"A",779,"2017-07-11","PRIYANKA DEVI CHOUDHARY",null,"BHERU LAL CHOUDHARY","SURGYAN DEVI","F","2012-04-20",927,null,161,127,"OBC","Hindu",null,"GOVT. SENIOR SECONDARY SCHOOL",8210302,"XXXX5364",null,77426475824,"xyz  ajmer ,rajasthan 3333584",0,"N","N","No",14,"None",3]
[9,"A",470,"2018-07-04","PRIYANKA MEGHWANSHI",null,"HANUMAN MEGHWANSHI","MAMTA DEVI","F","2010-11-28",928,null,161,112,"SC","Hindu",null,"GOVT. SENIOR SECONDARY SCHOOL",8210302,"XXXX5183","VPPGRGV",77426475825,"xyz  ajmer ,rajasthan 3333585",40000,"N","N","No",16,"None",1]
[9,"A",913,"2024-07-31","PUKHRAJ BHEEL",null,"RAMESHWAR BHEEL","ASHA DEVI","M","2008-08-05",929,null,161,87,"ST",null,null,"GOVT. SENIOR SECONDARY SCHOOL",8210302,"XXXX1303","YISFAKK",77426475826,"xyz  ajmer ,rajasthan 3333586",45000,"N","N",null,18,"None",0]
[9,"A",445,"2017-07-28","RINKU PRAJAPAT",null,"DHARMICHAND PRAJAPAT","RAMKANYA DEVI","F","2012-01-01",930,null,161,138,"OBC","Hindu",null,"GOVT. SENIOR SECONDARY SCHOOL",8210302,"XXXX8463",null,77426475827,"xyz  ajmer ,rajasthan 3333587",50000,"N","N","No",14,"None",0]
[9,"A",376,"2017-06-23","SAMEER JAT",null,"KALU RAM JAT","RESH DEVI","M","2011-08-07",931,null,161,146,"OBC","Hindu",null,"GOVT. SENIOR SECONDARY SCHOOL",8210302,"XXXX9676","YGFFYUO",77426475828,"xyz  ajmer ,rajasthan 3333588",40000,"N","N","No",15,"None",0]
[9,"A",783,"2018-07-23","SAMINA DEVI CHOUDHARY",null,"KANARAM CHOUDHARY","MANBHAR DEVI","F","2013-04-10",932,null,161,109,"OBC","Hindu",null,"GOVT. SENIOR SECONDARY SCHOOL",8210302,"XXXX0095",null,77426475829,"xyz  ajmer ,rajasthan 3333589",0,"N","N","No",13,"None",3]
[9,"A",931,"2025-07-10","SANJU BHEEL",null,"GHEESA BHEEL","RAMKANYA BHEEL","F","2011-03-30",933,null,161,120,"ST",null,null,"GOVT. SENIOR SECONDARY SCHOOL",8210302,"XXXX4483",null,77426475830,"xyz  ajmer ,rajasthan 3333590",30000,"N","N",null,15,"None",0]
[9,"A",945,"2025-07-17","Sanju Choudhary",null,"Basram Choudhary","Amari Devi","F","2012-01-27",934,null,161,116,"OBC","Hindu",null,"GOVT. SENIOR SECONDARY SCHOOL",8210302,"XXXX4464",null,77426475831,"xyz  ajmer ,rajasthan 3333591",80000,"N","N","No",14,"None",3]
[9,"A",631,"2020-08-13","SHAITAN JAT",null,"Basram Jat","CHANTA DEVI","M","2010-01-01",935,null,161,106,"OBC","Hindu",null,"GOVT. SENIOR SECONDARY SCHOOL",8210302,"XXXX0735",null,77426475832,"xyz  ajmer ,rajasthan 3333592",60000,"N","N","No",16,"None",0]
[9,"A",725,"2021-08-23","Shaukeen Prajapat",null,"Hansraj Prajapat","Prem Devi","M","2011-08-03",936,null,161,100,"OBC","Hindu",null,"GOVT. SENIOR SECONDARY SCHOOL",8210302,"XXXX6921",null,77426475833,"xyz  ajmer ,rajasthan 3333593",80000,"N","N","No",15,"None",0]
[9,"A",932,"2025-07-10","Shivam Dadhich",null,"Prakash Chandra Sharma","Lalita Sharma","M","2012-03-20",937,null,161,147,"GEN","Hindu",null,"GOVT. SENIOR SECONDARY SCHOOL",8210302,null,null,77426475834,"xyz  ajmer ,rajasthan 3333594",60000,"N","N","No",14,"None",0]
[9,"A",928,"2025-07-09","SHIVRAJ BHEEL",null,"PANCHU BHEEL","RAMESHWARI DEVI","M","2012-11-05",938,null,161,130,"ST",null,null,"GOVT. SENIOR SECONDARY SCHOOL",8210302,"XXXX3833",null,77426475835,"xyz  ajmer ,rajasthan 3333595",45000,"N","N",null,14,"None",0]
[9,"A",749,"2021-11-23","Sonika",null,"Rajendra Jat","Rampyari","F","2011-01-01",939,null,161,119,"OBC","Hindu",null,"GOVT. SENIOR SECONDARY SCHOOL",8210302,"XXXX5144",null,77426475836,"xyz  ajmer ,rajasthan 3333596",60000,"N","N","No",15,"None",3]
[9,"A",411,"2017-07-05","SUKHPAL PRAJAPAT",null,"HANUMAN PRAJAPAT","SAYARI","M","2011-04-15",940,null,161,143,"OBC","Hindu",null,"GOVT. SENIOR SECONDARY SCHOOL",8210302,"XXXX2959",null,77426475837,"xyz  ajmer ,rajasthan 3333597",30000,"N","N","No",15,"None",0]
[9,"A",602,"2019-08-28","Suman Choudhary",null,"Gopal Choudhary","Mandraj Devi","F","2012-08-21",941,null,161,131,"OBC","Hindu",null,"GOVT. SENIOR SECONDARY SCHOOL",8210302,"XXXX2311",null,77426475838,"xyz  ajmer ,rajasthan 3333598",48000,"N","N","No",14,"None",0]
[9,"A",943,"2025-07-16","Sunil Choudhary",null,"Shokin Jat","Indra Devi","M","2011-03-14",942,null,161,126,"OBC","Hindu",null,"GOVT. SENIOR SECONDARY SCHOOL",8210302,null,null,77426475839,"xyz  ajmer ,rajasthan 3333599",60000,"N","N","No",15,"None",1]
[9,"A",382,"2017-06-28","SUNITA PRAJAPAT",null,"PRABHU PRAJAPAT","SITA DEVI","F","2011-03-20",943,null,161,137,"OBC","Hindu",null,"GOVT. SENIOR SECONDARY SCHOOL",8210302,"XXXX4983","YIGMFFW",77426475840,"xyz  ajmer ,rajasthan 3333600",70000,"N","N","No",15,"None",0]
[9,"A",946,"2025-07-17","Ummed Singh Choudhary",null,"Ram Singh","Ganga Devi","M","2010-05-05",944,null,161,95,"OBC",null,null,"GOVT. SENIOR SECONDARY SCHOOL",8210302,"XXXX7084",null,77426475841,"xyz  ajmer ,rajasthan 3333601",50000,"N","N",null,16,"None",0]
[9,"A",402,"2017-07-04","VIJAY MEGHWANSHI",null,"DHANRAJ MEGHWANSHI","MANJU DEVI","M","2011-06-03",945,null,161,105,"SC","Hindu",null,"GOVT. SENIOR SECONDARY SCHOOL",8210302,"XXXX0477","YYAKSDO",77426475842,"xyz  ajmer ,rajasthan 3333602",40000,"N","N","No",15,"None",0]
[9,"A",960,"2025-07-30","Vishnu Kumar Jat",null,"Ramniwas Jat","Surgyan Devi","M","2011-04-15",946,null,161,96,"OBC","Hindu",null,"GOVT. SENIOR SECONDARY SCHOOL",8210302,null,null,77426475843,"xyz  ajmer ,rajasthan 3333603",48000,"N","N","No",15,"None",2]
[9,"A",944,"2025-07-17","Yashraj Choudhary",null,"Basram Choudhary","Amari Devi","M","2010-07-21",947,null,161,126,"OBC",null,null,"GOVT. SENIOR SECONDARY SCHOOL",8210302,"XXXX0945",null,77426475844,"xyz  ajmer ,rajasthan 3333604",80000,"N","N",null,16,"None",3]
[9,"A",661,"2021-02-24","Yasmin",null,"Ahasan Ali","Naraj Banu","F","2009-04-29",948,null,161,108,"OBC","Muslim",null,"GOVT. SENIOR SECONDARY SCHOOL",8210302,"XXXX9680",null,77426475845,"xyz  ajmer ,rajasthan 3333605",80000,"N","N","Yes",17,"None",0]
[10,"A",506,"2018-07-11","ANJU JAT",null,"KAILASH CHAND JAT","SAMPAT DEVI","F","2009-01-01",null,null,129,93,"OBC","Hindu",null,"GOVT. SENIOR SECONDARY SCHOOL",8210302,"XXXX8095",null,77426475846,"xyz  ajmer ,rajasthan 3333606",50000,"N","N","No",17,"None",0]
[10,"A",571,"2019-07-15","ARJUN JAT",null,"KAILASH JAT","JADAV DEVI","M","2009-05-05",null,null,129,128,"OBC","Hindu",null,"GOVT. SENIOR SECONDARY SCHOOL",8210302,"XXXX0799","WFGKGVG",77426475847,"xyz  ajmer ,rajasthan 3333607",36000,"N","N","No",17,"None",0]
[10,"A",692,"2021-07-15","Cheana Jat",null,"Hardayal Jat","Meera Devi","F","2010-01-01",null,null,129,118,"OBC","Hindu",null,"GOVT. SENIOR SECONDARY SCHOOL",8210302,"XXXX4136",null,77426475848,"xyz  ajmer ,rajasthan 3333608",60000,"N","N","No",16,"None",3]
[10,"A",352,"2016-07-06","DEEPAK JAT",null,"BHAGCHAND JAT","LALI DEVI","M","2010-01-18",null,null,129,128,"OBC","Hindu",null,"GOVT. SENIOR SECONDARY SCHOOL",8210302,"XXXX8893","WFOKCDS",77426475849,"xyz  ajmer ,rajasthan 3333609",60000,"N","N","No",16,"None",0]
[10,"A",243,null,"KALU KUMHAR",null,"SHRAWAN KUMHAR","SANTOSH KUMHAR","M","2008-04-11",null,null,129,77,"OBC","Hindu",null,"GOVT. SENIOR SECONDARY SCHOOL",8210302,"XXXX4002","VSPNWNV",77426475850,"xyz  ajmer ,rajasthan 3333610",50000,"N","N","No",18,"None",0]
[10,"A",698,"2021-07-20","Karina Jat",null,"Gopiram Choudhary","Seema Devi","F","2011-01-01",null,null,129,127,"OBC","Hindu",null,"GOVT. SENIOR SECONDARY SCHOOL",8210302,"XXXX0702",null,77426475851,"xyz  ajmer ,rajasthan 3333611",0,"N","N","No",15,"None",3]
[10,"A",521,"2018-07-24","KARTIK VAISHNAV",null,"SATYANARAYAN VAISHNAV","NERAJ DEVI","M","2008-09-10",null,null,129,126,"OBC","Hindu",null,"GOVT. SENIOR SECONDARY SCHOOL",8210302,"XXXX2619","BCIDFAB",77426475852,"xyz  ajmer ,rajasthan 3333612",40000,"N","N","No",18,"None",0]
[10,"A",349,"2016-07-05","KHUSHI MEGHWANSHI",null,"RAMDHAN MEGHWANSHI","PANCHI DEVI","F","2008-12-16",null,null,129,106,"SC","Hindu",null,"GOVT. SENIOR SECONDARY SCHOOL",8210302,"XXXX7184","VGVNBNJ",77426475853,"xyz  ajmer ,rajasthan 3333613",60000,"N","N","No",18,"None",0]
[10,"A",714,"2021-08-02","Khushi Ram",null,"Shaitan","Mand Raj Devi","M","2009-04-23",null,null,129,126,"OBC","Hindu",null,"GOVT. SENIOR SECONDARY SCHOOL",8210302,"XXXX0397",null,77426475854,"xyz  ajmer ,rajasthan 3333614",0,"N","N","No",17,"None",3]
[10,"A",326,"2016-06-25","KIRAN RAIDAS",null,"KALU RAM RAIDAS","SONU DEVI","F","2009-11-02",null,null,129,126,"SC","Hindu",null,"GOVT. SENIOR SECONDARY SCHOOL",8210302,"XXXX7218","VKSKXZV",77426475855,"xyz  ajmer ,rajasthan 3333615",48000,"N","N","No",17,"None",0]
[10,"A",947,"2025-07-17","Kritika Vaishnav",null,"Sanjay Vaishnav","Kalawati Devi","F","2010-09-05",null,null,129,112,"OBC","Hindu",null,"GOVT. SENIOR SECONDARY SCHOOL",8210302,"XXXX8980",null,77426475856,"xyz  ajmer ,rajasthan 3333616",72000,"N","N","No",16,"None",20]
[10,"A",361,"2016-07-15","LEELA PRAJAPAT",null,"BIRDI CHAND PRAJAPAT","SHYAMA DEVI","F","2010-03-10",null,null,129,128,"OBC","Hindu",null,"GOVT. SENIOR SECONDARY SCHOOL",8210302,"XXXX2422",null,77426475857,"xyz  ajmer ,rajasthan 3333617",40000,"N","N","No",16,"None",0]
[10,"A",343,"2016-07-04","MAHENDRA CHOUDHARY",null,"HETRAM CHOUDHARY","MAINA DEVI","M","2008-08-01",null,null,129,128,"OBC","Hindu",null,"GOVT. SENIOR SECONDARY SCHOOL",8210302,"XXXX7212","YJSFEIK",77426475858,"xyz  ajmer ,rajasthan 3333618",40000,"N","N","No",18,"None",0]
[10,"A",517,"2018-07-14","MAHENDRA CHOUDHARY",null,"SHYOJI CHOUDHARY","MANFOOL DEVI","M","2010-03-10",null,null,129,127,"OBC","Hindu",null,"GOVT. SENIOR SECONDARY SCHOOL",8210302,"XXXX3349","VMMJHNV",77426475859,"xyz  ajmer ,rajasthan 3333619",60000,"N","N","No",16,"None",0]
[10,"A",741,"2021-09-29","Mallika",null,"Kaluram Choudhary","Ganga Devi","F","2011-03-26",null,null,129,127,"OBC","Hindu",null,"GOVT. SENIOR SECONDARY SCHOOL",8210302,"XXXX4480",null,77426475860,"xyz  ajmer ,rajasthan 3333620",50000,"N","N","No",15,"None",3]
[10,"A",505,"2018-07-11","MAMTA JAT",null,"KANARAM JAT","NORATI DEVI","F","2010-10-13",null,null,129,121,"OBC","Hindu",null,"GOVT. SENIOR SECONDARY SCHOOL",8210302,"XXXX0155","YKSOWGK",77426475861,"xyz  ajmer ,rajasthan 3333621",60000,"N","N","No",16,"None",1]
[10,"A",522,"2018-07-16","MOHAN DEVI",null,"RAMDEV CHOUDHARY","MEERA DEVI","F","2010-06-10",null,null,129,128,"OBC","Hindu",null,"GOVT. SENIOR SECONDARY SCHOOL",8210302,"XXXX6245","YOOIUES",77426475862,"xyz  ajmer ,rajasthan 3333622",60000,"N","N","No",16,"None",3]
[10,"A",904,"2024-07-19","Naraj",null,"Ramgopal","Barma Devi","F","2009-06-22",null,null,129,127,"OBC","Hindu",null,"GOVT. SENIOR SECONDARY SCHOOL",8210302,"XXXX9709",null,77426475863,"xyz  ajmer ,rajasthan 3333623",72000,"N","N","No",17,"None",0]
[10,"A",390,"2017-07-01","POOJA CHOUDHARY",null,"SONARAYAN CHOUDHARY","NARAJ DEVI","F","2010-09-04",null,null,129,121,"OBC","Hindu",null,"GOVT. SENIOR SECONDARY SCHOOL",8210302,"XXXX6892","YUEWBWK",77426475864,"xyz  ajmer ,rajasthan 3333624",60000,"N","N","No",16,"None",0]
[10,"A",687,"2021-07-14","PRIYANKA DEVI MEGHWANSHI",null,"RAJU MEGHWANSHI","MANJU DEVI","F","2009-10-24",null,null,129,110,"SC",null,null,"GOVT. SENIOR SECONDARY SCHOOL",8210302,"XXXX2689",null,77426475865,"xyz  ajmer ,rajasthan 3333625",48000,"N","N",null,17,"None",1]
[10,"A",329,"2016-07-01","PRIYANKA PRAJAPAT",null,"GANESH PRAJAPAT","ASHA DEVI","F","2009-08-02",null,null,129,128,"OBC","Hindu",null,"GOVT. SENIOR SECONDARY SCHOOL",8210302,"XXXX3794","YIAYYKW",77426475866,"xyz  ajmer ,rajasthan 3333626",48000,"N","N","No",17,"None",0]
[10,"A",961,"2025-08-14","Rakesh Choudhary",null,"Govind Choudhary","Jivni","M","2008-06-05",null,null,129,107,"OBC","Hindu",null,"GOVT. SENIOR SECONDARY SCHOOL",8210302,null,null,77426475867,"xyz  ajmer ,rajasthan 3333627",60000,"N","N","No",18,"None",0]
[10,"A",325,"2016-05-09","RAM SINGH JAT",null,"MISHRI JAT","KALI DEVI","M","2010-04-28",null,null,129,120,"OBC","Hindu",null,"GOVT. SENIOR SECONDARY SCHOOL",8210302,"XXXX7351","VZPGNHT",77426475868,"xyz  ajmer ,rajasthan 3333628",48000,"N","N","No",16,"None",0]
[10,"A",742,"2021-09-29","RASILA DEVI CHOUDHARY",null,"KANARAM","MANBHAR DEVI","F","2010-04-10",null,null,129,121,"OBC","Hindu",null,"GOVT. SENIOR SECONDARY SCHOOL",8210302,"XXXX1721",null,77426475869,"xyz  ajmer ,rajasthan 3333629",45000,"N","N","No",16,"None",1]
[10,"A",523,"2018-07-25","REENA JAT",null,"KALU RAM JAT","SANTOSH DEVI","F","2012-05-02",null,null,129,121,"OBC","Hindu",null,"GOVT. SENIOR SECONDARY SCHOOL",8210302,"XXXX0841","YIAGIUS",77426475870,"xyz  ajmer ,rajasthan 3333630",60000,"N","N","No",14,"None",3]
[10,"A",697,"2021-07-20","Rohit",null,"Shyojiram Jat","Kali Devi","M","2008-08-06",null,null,129,126,"OBC","Hindu",null,"GOVT. SENIOR SECONDARY SCHOOL",8210302,"XXXX2536",null,77426475871,"xyz  ajmer ,rajasthan 3333631",50000,"N","N","No",18,"None",3]
[10,"A",896,"2024-07-16","SALTA BHEEL",null,"PAPPU BHEEL","LADA DEVI","F","2010-01-23",null,null,129,128,"ST",null,null,"GOVT. SENIOR SECONDARY SCHOOL",8210302,"XXXX0958",null,77426475872,"xyz  ajmer ,rajasthan 3333632",30000,"N","N",null,16,"None",0]
[10,"A",407,"2017-07-04","SANJU CHOUDHARY",null,"RAYMAL CHOUDHARY","MATHURA DEVI","F","2011-02-02",null,null,129,128,"OBC","Hindu",null,"GOVT. SENIOR SECONDARY SCHOOL",8210302,"XXXX6804",null,77426475873,"xyz  ajmer ,rajasthan 3333633",40000,"N","N","No",15,"None",0]
[10,"A",773,"2022-07-13","SHEELA",null,"HEMRAJ","LADI DEVI","F","2011-01-20",null,null,129,128,"OBC","Hindu",null,"GOVT. SENIOR SECONDARY SCHOOL",8210302,"XXXX1471",null,77426475874,"xyz  ajmer ,rajasthan 3333634",39000,"N","N","No",15,"None",1]
[10,"A",626,"2020-08-13","Sintu Jat",null,"RANJEET JAT","Kamla Devi","F","2009-08-31",null,null,129,127,"OBC","Hindu",null,"GOVT. SENIOR SECONDARY SCHOOL",8210302,"XXXX5116",null,77426475875,"xyz  ajmer ,rajasthan 3333635",60000,"N","N","No",17,"None",0]
[10,"A",406,"2017-07-04","SUMAN CHOUDHARY",null,"JAY SINGH CHOUDHARY","NARBADA DEVI","F","2011-05-05",null,null,129,119,"OBC","Hindu",null,"GOVT. SENIOR SECONDARY SCHOOL",8210302,"XXXX5811","VOOCJWV",77426475876,"xyz  ajmer ,rajasthan 3333636",40000,"N","N","No",15,"None",0]
[10,"A",357,"2016-07-13","SUMAN CHOUDHARY",null,"HAGAMA CHOUDHARY","MATRA DEVI","F","2011-08-01",null,null,129,120,"OBC","Hindu",null,"GOVT. SENIOR SECONDARY SCHOOL",8210302,"XXXX1173","VPJCSBR",77426475877,"xyz  ajmer ,rajasthan 3333637",55000,"N","N","No",15,"None",3]
[10,"A",324,"2016-05-07","SUMAN JAT",null,"LALA RAM JAT","MATHURA DEVI","F","2010-06-30",null,null,129,128,"OBC","Hindu",null,"GOVT. SENIOR SECONDARY SCHOOL",8210302,"XXXX8683","WXWBJZH",77426475878,"xyz  ajmer ,rajasthan 3333638",40000,"N","N","No",16,"None",0]
[10,"A",555,"2019-07-06","SUMAN JAT",null,"SHAUNKIN JAT","INDRA DEVI","F","2010-02-09",null,null,129,128,"OBC","Hindu",null,"GOVT. SENIOR SECONDARY SCHOOL",8210302,"XXXX4595","vkgcpxn",77426475879,"xyz  ajmer ,rajasthan 3333639",48000,"N","N","No",16,"None",0]
[10,"A",695,"2021-07-15","Suraj Prajapat",null,"Bhagchand Kumhar","Panchi Devi","M","2011-09-06",null,null,129,128,"OBC","Hindu",null,"GOVT. SENIOR SECONDARY SCHOOL",8210302,"XXXX4165",null,77426475880,"xyz  ajmer ,rajasthan 3333640",50000,"N","N","No",15,"None",0]
[10,"A",351,"2016-07-06","SURENDRA CHOUDHARY",null,"HARI RAM CHOUDHARY","RAMSWARI DEVI","M","2010-07-15",null,null,129,128,"OBC","Hindu",null,"GOVT. SENIOR SECONDARY SCHOOL",8210302,"XXXX4857","YIWSWQO",77426475881,"xyz  ajmer ,rajasthan 3333641",70000,"N","N","No",16,"None",0]
[10,"A",356,"2016-07-13","TANVI JANGID",null,"NANDKISHOR JANGID","MAMTA JANGID","F","2010-06-11",null,null,129,128,"OBC","Hindu",null,"GOVT. SENIOR SECONDARY SCHOOL",8210302,"XXXX1236","YGBMBYO",77426475882,"xyz  ajmer ,rajasthan 3333642",50000,"N","N","No",16,"None",0]
[10,"A",438,"2017-07-21","TEJPAL CHOUDHARY",null,"HANSRAJ CHOUDHARY","KALI DEVI","M","2011-08-03",null,null,129,128,"OBC","Hindu",null,"GOVT. SENIOR SECONDARY SCHOOL",8210302,"XXXX8440","VNNJHKX",77426475883,"xyz  ajmer ,rajasthan 3333643",60000,"N","N","No",15,"None",0]
[10,"A",327,"2016-06-27","VINOD PRAJAPAT",null,"MAHAVEER PRAJAPAT","MANBHAR DEVI","M","2010-01-13",null,null,129,127,"OBC","Hindu",null,"GOVT. SENIOR SECONDARY SCHOOL",8210302,"XXXX7027","VNGOHHV",77426475884,"xyz  ajmer ,rajasthan 3333644",60000,"N","N","No",16,"None",0]
[11,"A",948,"2025-07-21","Brahmanand Choudhary",null,"Badri Lal Choudhary","Sambhudi Devi","M","2010-06-13",1101,null,159,94,"OBC","Hindu",null,"GOVT. SENIOR SECONDARY SCHOOL",8210302,null,null,77426475885,"xyz  ajmer ,rajasthan 3333645",48000,"N","N","No",16,"None",0]
[11,"A",591,"2019-08-02","CHANNU BHEEL",null,"MAHAVEER BHEEL","MANDRAJ DEVI","F","2010-02-25",1102,null,159,76,"ST","Hindu",null,"GOVT. SENIOR SECONDARY SCHOOL",8210302,"XXXX2054","VBZTJJK",77426475886,"xyz  ajmer ,rajasthan 3333646",48000,"N","N","No",16,"None",3]
[11,"A",227,null,"DEEPAK PRAJAPAT",null,"SHRAWAN PRAJAPAT","SANTOSH DEVI","M","2006-07-02",1103,null,159,106,"OBC","Hindu",null,"GOVT. SENIOR SECONDARY SCHOOL",8210302,"XXXX5614","VSPNWNV",77426475887,"xyz  ajmer ,rajasthan 3333647",40000,"N","N","No",20,"None",0]
[11,"A",637,"2020-08-14","DEEPU",null,"RAMESH","SHANA","M","2008-01-01",1104,null,159,128,"OBC","Hindu",null,"GOVT. SENIOR SECONDARY SCHOOL",8210302,"XXXX9296",null,77426475888,"xyz  ajmer ,rajasthan 3333648",50000,"N","N","No",18,"None",0]
[11,"A",374,"2016-10-17","DINESH JAT",null,"JORU JAT","SUMITRA DEVI","M","2011-03-04",1105,null,159,114,"OBC","Hindu",null,"GOVT. SENIOR SECONDARY SCHOOL",8210302,"XXXX4858","YKSOCSC",77426475889,"xyz  ajmer ,rajasthan 3333649",40000,"N","N","No",15,"None",0]
[11,"A",256,null,"GORA JAT",null,"RAYMAL JAT","MATHARA DEVI","F","2009-06-20",1106,null,159,131,"OBC","Hindu",null,"GOVT. SENIOR SECONDARY SCHOOL",8210302,"XXXX2464","YKSOCSC",77426475890,"xyz  ajmer ,rajasthan 3333650",36000,"N","N","No",17,"None",0]
[11,"A",815,"2023-07-07","Kamlesh Choudhary",null,"Pradhan Choudhary","Neraj Devi","F","2010-01-11",1107,null,159,132,"OBC","Hindu",null,"GOVT. SENIOR SECONDARY SCHOOL",8210302,"XXXX8983",null,77426475891,"xyz  ajmer ,rajasthan 3333651",50000,"N","N","No",16,"None",0]
[11,"A",426,"2017-07-07","KANHAIYA KUMHAR",null,"KALU RAM KUMHAR","NARAYANI DEVI","M","2009-06-30",1108,null,159,113,"OBC","Hindu",null,"GOVT. SENIOR SECONDARY SCHOOL",8210302,"XXXX7055","VRPTXXV",77426475892,"xyz  ajmer ,rajasthan 3333652",60000,"N","N","No",17,"None",0]
[11,"A",663,"2021-02-22","KARTAR CHOUDHARY",null,"RAMRAJ CHOUDHARY","RUKMA","M","2009-07-10",1109,null,159,97,"OBC","Hindu",null,"GOVT. SENIOR SECONDARY SCHOOL",8210302,"XXXX4516",null,77426475893,"xyz  ajmer ,rajasthan 3333653",50000,"N","N","No",17,"None",0]
[11,"A",600,"2019-08-22","KAVITA PRAJAPAT",null,"BASRAM PRAJAPAT","ANNU DEVI","F","2009-07-14",1110,null,159,112,"OBC","Hindu",null,"GOVT. SENIOR SECONDARY SCHOOL",8210302,"XXXX1877",null,77426475894,"xyz  ajmer ,rajasthan 3333654",50000,"N","N","No",17,"None",0]
[11,"A",299,null,"KHUSHI RAM JAT",null,"RAM LAL JAT","KALI DEVI","M","2009-08-02",1111,null,159,105,"OBC","Hindu",null,"GOVT. SENIOR SECONDARY SCHOOL",8210302,"XXXX9937","YIMYIEW",77426475895,"xyz  ajmer ,rajasthan 3333655",36000,"N","N","No",17,"None",0]
[11,"A",393,"2017-07-01","MANISHA CHOUDHARY",null,"SONARAYAN CHOUDHARY","NARAJ DEVI","F","2008-07-15",1112,null,159,99,"OBC","Hindu",null,"GOVT. SENIOR SECONDARY SCHOOL",8210302,"XXXX4672","BCQUEQG",77426475896,"xyz  ajmer ,rajasthan 3333656",48000,"N","N","No",18,"None",0]
[11,"A",260,null,"MANSHA JAT",null,"KALU RAM JAT","RESH DEVI","F","2010-01-05",1113,null,159,131,"OBC","Hindu",null,"GOVT. SENIOR SECONDARY SCHOOL",8210302,"XXXX6920","YGFFYUO",77426475897,"xyz  ajmer ,rajasthan 3333657",36000,"N","N","No",16,"None",0]
[11,"A",300,"2015-07-08","NARAJ PRAJAPAT",null,"KAILASH PRAJAPAT","KANCHAN DEVI","F","2009-07-06",1114,null,159,128,"OBC","Hindu",null,"GOVT. SENIOR SECONDARY SCHOOL",8210302,"XXXX1280","VGBPRTV",77426475898,"xyz  ajmer ,rajasthan 3333658",48000,"N","N","No",17,"None",0]
[11,"A",336,"2016-07-02","NEETU CHOUDHARY",null,"KARTAR CHOUDHARY","GYARSI DEVI","F","2009-02-15",1115,null,159,109,"OBC","Hindu",null,"GOVT. SENIOR SECONDARY SCHOOL",8210302,"XXXX8383","VGWGNVR",77426475899,"xyz  ajmer ,rajasthan 3333659",62000,"N","N","No",17,"None",3]
[11,"A",764,"2022-07-05","PRAKASH CHOUDHARY",null,"RAMSINGH CHOUDHARY","SAMOTRA DEVI","M","2009-08-08",1116,null,159,109,"OBC","Hindu",null,"GOVT. SENIOR SECONDARY SCHOOL",8210302,"XXXX3897","YGFFYSK",77426475900,"xyz  ajmer ,rajasthan 3333660",60000,"N","N","No",17,"None",1]
[11,"A",345,"2016-07-04","PRAVEEN CHOUDHARY",null,"HETRAM CHOUADHARY","MAINA DEVI","M","2008-04-12",1117,null,159,125,"OBC","Hindu",null,"GOVT. SENIOR SECONDARY SCHOOL",8210302,"XXXX2074","YGSFEIK",77426475901,"xyz  ajmer ,rajasthan 3333661",60000,"N","N","No",18,"None",0]
[11,"A",508,"2018-07-11","PRIYANKA JAT",null,"KANARAM JAT","NORATI DEVI","F","2008-08-06",1118,null,159,103,"OBC","Hindu",null,"GOVT. SENIOR SECONDARY SCHOOL",8210302,"XXXX1388","YKSOWGK",77426475902,"xyz  ajmer ,rajasthan 3333662",60000,"N","N","No",18,"None",0]
[11,"A",655,"2021-01-25","RINKU JAT",null,"DHANRAJ JAT","KOPAN DEVI","F","2010-03-14",1119,null,159,100,"OBC","Hindu",null,"GOVT. SENIOR SECONDARY SCHOOL",8210302,"XXXX7861",null,77426475903,"xyz  ajmer ,rajasthan 3333663",50000,"N","N","No",16,"None",3]
[11,"A",412,"2017-07-05","SANJU PRAJAPAT",null,"HANUMAN PRAJAPAT","SAYARI","F","2008-05-20",1120,null,159,125,"OBC","Hindu",null,"GOVT. SENIOR SECONDARY SCHOOL",8210302,"XXXX5017","VPCSHWJ",77426475904,"xyz  ajmer ,rajasthan 3333664",60000,"N","N","No",18,"None",0]
[11,"A",832,"2023-07-13","SEEMA DEVI BHEEL",null,"BHAIRU LAL BHEEL","CHANTA DEVI","F","2009-06-08",1121,null,159,101,"ST","Hindu",null,"GOVT. SENIOR SECONDARY SCHOOL",8210302,"XXXX7788","VTTBRJJ",77426475905,"xyz  ajmer ,rajasthan 3333665",48000,"N","N","No",17,"None",0]
[11,"A",614,"2020-07-31","SHANKAR MEGHWANSHI",null,"SEETARAM MEGHWANSHI","MAYA DEVI","M","2010-04-16",1122,null,159,118,"SC","Hindu",null,"GOVT. SENIOR SECONDARY SCHOOL",8210302,"XXXX5985",null,77426475906,"xyz  ajmer ,rajasthan 3333666",50000,"N","N","No",16,"None",0]
[11,"A",622,"2020-08-10","SUMAN DEVI MEGHWANSHI",null,"JATANARAM MEGHWANSHI","NOSHAR DEVI","F","2008-07-01",1123,null,159,93,"SC",null,null,"GOVT. SENIOR SECONDARY SCHOOL",8210302,"XXXX5121",null,77426475907,"xyz  ajmer ,rajasthan 3333667",0,"N","N",null,18,"None",1]
[11,"A",616,"2020-08-10","YASPAL",null,"KANARAM","INDRA DEVI","M","2009-02-24",1124,null,159,98,"OBC","Hindu",null,"GOVT. SENIOR SECONDARY SCHOOL",8210302,"XXXX4839",null,77426475908,"xyz  ajmer ,rajasthan 3333668",50000,"N","N","No",17,"None",3]
[12,"A",744,"2021-10-20","AISH PAL",null,"BADRI LAL","SOMA DEVI","M","2008-02-02",1201,null,127,111,"ST","Hindu",null,"GOVT. SENIOR SECONDARY SCHOOL",8210302,"XXXX0121",null,77426475909,"xyz  ajmer ,rajasthan 3333669",50000,"N","N","No",18,"None",3]
[12,"A",866,"2023-08-10","Aman Ali",null,"Shahjad Ali","Salma","M","2010-02-17",1202,null,127,111,"OBC","Muslim",null,"GOVT. SENIOR SECONDARY SCHOOL",8210302,null,null,77426475910,"xyz  ajmer ,rajasthan 3333670",48000,"N","N","Yes",16,"None",0]
[12,"A",414,"2017-07-06","ANIL MEGHWANSHI",null,"PANCHU RAM MEGHWANSHI","MANBHAR DEVI","M","2008-06-16",1203,null,127,122,"SC","Hindu",null,"GOVT. SENIOR SECONDARY SCHOOL",8210302,"XXXX8694","YKSMUIW",77426475911,"xyz  ajmer ,rajasthan 3333671",40000,"N","N","No",18,"None",0]
[12,"A",241,"2015-05-12","ASHOK PRAJAPAT",null,"HARLAL PRAJAPAT","KAMLESH DEVI","M","2008-07-03",1204,null,127,121,"OBC","Hindu",null,"GOVT. SENIOR SECONDARY SCHOOL",8210302,"XXXX6220","WFGCQFF",77426475912,"xyz  ajmer ,rajasthan 3333672",36000,"Y","N","No",18,"None",0]
[12,"A",588,"2019-07-31","BASRAM CHOUDHARY",null,"GOPAL CHOUDHARY","MANDRAJ DEVI","M","2009-01-02",1205,null,127,113,"OBC","Hindu",null,"GOVT. SENIOR SECONDARY SCHOOL",8210302,"XXXX4270","vrcxvnv",77426475913,"xyz  ajmer ,rajasthan 3333673",48000,"N","N","No",17,"None",0]
[12,"A",255,null,"CHHITAR JAT",null,"MISARI LAL JAT","KALI DEVI","M","2008-07-01",1206,null,127,121,"OBC","Hindu",null,"GOVT. SENIOR SECONDARY SCHOOL",8210302,"XXXX9389","VZPGNHT",77426475914,"xyz  ajmer ,rajasthan 3333674",36000,"N","N","No",18,"None",0]
[12,"A",772,"2022-07-13","Dashrath Choudhary",null,"Harikishan Choudhary","Samer Devi","M","2007-11-20",1207,null,127,124,"OBC","Hindu",null,"GOVT. SENIOR SECONDARY SCHOOL",8210302,"XXXX5484",null,77426475915,"xyz  ajmer ,rajasthan 3333675",50000,"N","N","No",19,"None",1]
[12,"A",915,"2024-07-31","Dinesh Jat",null,"Shri Ram Jat","Nathi Devi","M","2009-08-07",1208,null,127,121,"OBC","Hindu",null,"GOVT. SENIOR SECONDARY SCHOOL",8210302,null,null,77426475916,"xyz  ajmer ,rajasthan 3333676",60000,"N","N","No",17,"None",3]
[12,"A",511,"2018-07-11","GANESH MEGHWANSHI",null,"PARAS MEGHWANSHI","CHANTA DEVI","M","2008-08-01",1209,null,127,121,"SC","Hindu",null,"GOVT. SENIOR SECONDARY SCHOOL",8210302,"XXXX6138","VPJCSBP",77426475917,"xyz  ajmer ,rajasthan 3333677",40000,"N","N","No",18,"None",3]
[12,"A",281,null,"GOURA PRAJAPAT",null,"KAILASH PRAJAPAT","SAMPAT DEVI","F","2009-02-01",1210,null,127,122,"OBC","Hindu",null,"GOVT. SENIOR SECONDARY SCHOOL",8210302,"XXXX4923","VGZZVSP",77426475918,"xyz  ajmer ,rajasthan 3333678",36000,"N","N","No",17,"None",0]
[12,"A",578,"2019-07-24","GUDDA",null,"KAILASH NAYAK","SURMA DEVI","F","2008-08-31",1211,null,127,72,"SC","Hindu",null,"GOVT. SENIOR SECONDARY SCHOOL",8210302,"XXXX6976","YMECKOB",77426475919,"xyz  ajmer ,rajasthan 3333679",48000,"N","N","No",18,"None",3]
[12,"A",910,"2024-07-31","Kana Ram Choudhary",null,"Ramraj Choudhary","Suganta Devi","M","2008-03-02",1212,null,127,123,"OBC","Hindu",null,"GOVT. SENIOR SECONDARY SCHOOL",8210302,null,null,77426475920,"xyz  ajmer ,rajasthan 3333680",60000,"N","N","No",18,"None",0]
[12,"A",262,null,"LUCKY JANGID",null,"NANDKISHOR JANGID","MAMTA DEVI","M","2008-06-15",1213,null,127,125,"OBC","Hindu",null,"GOVT. SENIOR SECONDARY SCHOOL",8210302,"XXXX9609","YGBMQYO",77426475921,"xyz  ajmer ,rajasthan 3333681",36000,"N","N","No",18,"None",0]
[12,"A",259,null,"MAHENDRA JAT",null,"KALU RAM JAT","RESH DEVI","M","2008-06-22",1214,null,127,125,"OBC","Hindu",null,"GOVT. SENIOR SECONDARY SCHOOL",8210302,"XXXX9416","YGFFYUO",77426475922,"xyz  ajmer ,rajasthan 3333682",36000,"N","N","No",18,"None",0]
[12,"A",569,"2019-07-15","MAHENDRA PRAJAPAT",null,"SHRAWAN PRAJAPAT","SANTOSH PRAJAPAT","M","2007-02-16",1215,null,127,122,"OBC","Hindu",null,"GOVT. SENIOR SECONDARY SCHOOL",8210302,null,"VSPNWNV",77426475923,"xyz  ajmer ,rajasthan 3333683",48000,"N","N","No",19,"None",0]
[12,"A",269,null,"MANKHUSH CHOUDHARY",null,"RAMDEV CHOUDHARY","MANBHAR DEVI","F","2008-03-02",1216,null,127,124,"OBC","Hindu",null,"GOVT. SENIOR SECONDARY SCHOOL",8210302,"XXXX3838","YIOOGKK",77426475924,"xyz  ajmer ,rajasthan 3333684",36000,"N","N","No",18,"None",0]
[12,"A",590,"2019-08-02","NEPAL",null,"BRAHMANAND JAT","BADAM DEVI","F","2008-03-29",1217,null,127,122,"OBC",null,null,"GOVT. SENIOR SECONDARY SCHOOL",8210302,"XXXX8574","ygdgyuf",77426475925,"xyz  ajmer ,rajasthan 3333685",40000,"N","N",null,18,"None",3]
[12,"A",509,"2018-07-11","NIRMA DEVI MEGHWANSHI",null,"GANGA RAM MEGHWANSHI","LALI DEVI","F","2006-09-01",1218,null,127,125,"SC","Hindu",null,"GOVT. SENIOR SECONDARY SCHOOL",8210302,"XXXX1133","VGZZVWJ",77426475926,"xyz  ajmer ,rajasthan 3333686",60000,"N","N","No",20,"None",3]
[12,"A",239,"2015-05-12","NIRMA PRAJAPAT",null,"MAHAVEER PRAJAPAT","MANBHAR DEVI","F","2008-06-10",1219,null,127,122,"OBC","Hindu",null,"GOVT. SENIOR SECONDARY SCHOOL",8210302,"XXXX1602","VNGOHHV",77426475927,"xyz  ajmer ,rajasthan 3333687",48000,"N","N","No",18,"None",0]
[12,"A",512,"2018-07-11","PRIYANKA CHOUDHARY",null,"SHYOJI CHOUDHARY","KALI DEVI","F","2006-05-10",1220,null,127,122,"OBC","Hindu",null,"GOVT. SENIOR SECONDARY SCHOOL",8210302,"XXXX6838","YGSFEOS",77426475928,"xyz  ajmer ,rajasthan 3333688",60000,"N","N","No",20,"None",3]
[12,"A",849,"2023-07-19","RANJEET JAT",null,"RAM LAL JAT","KALI DEVI","M","2008-06-08",1221,null,127,118,"OBC","Hindu",null,"GOVT. SENIOR SECONDARY SCHOOL",8210302,"XXXX1786","YIMYIEW",77426475929,"xyz  ajmer ,rajasthan 3333689",48000,"N","N","No",18,"None",0]
[12,"A",246,null,"SANJAY CHOUDHARY",null,"RAMRAJ CHOUDHARY","SUGANTA DEVI","M","2009-08-02",1222,null,127,120,"OBC","Hindu",null,"GOVT. SENIOR SECONDARY SCHOOL",8210302,"XXXX3835","YQCECAB",77426475930,"xyz  ajmer ,rajasthan 3333690",50000,"N","N","No",17,"None",0]
[12,"A",242,null,"SANWAR LAL JAT",null,"BANNA LAL JAT","NEER DEVI","M","2008-07-01",1223,null,127,118,"OBC","Hindu",null,"GOVT. SENIOR SECONDARY SCHOOL",8210302,"XXXX9780","WFYEONG",77426475931,"xyz  ajmer ,rajasthan 3333691",36000,"N","N","No",18,"None",0]
[12,"A",579,"2019-07-24","SEEMA",null,"SANGRAM SINGH CHOUDHARY","MANDRAJ","F","2008-05-06",1224,null,127,122,"OBC","Hindu",null,"GOVT. SENIOR SECONDARY SCHOOL",8210302,"XXXX4658","vwbrxvh",77426475932,"xyz  ajmer ,rajasthan 3333692",48000,"N","N","No",18,"None",3]
[12,"A",238,null,"SHIMLA PRAJAPAT",null,"GOVIND PRAJAPAT","PARSI DEVI","F","2008-07-01",1225,null,127,123,"OBC","Hindu",null,"GOVT. SENIOR SECONDARY SCHOOL",8210302,"XXXX6665","VNPVOJH",77426475933,"xyz  ajmer ,rajasthan 3333693",36000,"N","N","No",18,"None",0]
[12,"A",302,null,"SUGANTA PRAJAPAT",null,"HANSRAJ PRAJAPAT","PREM DEVI","F","2008-05-02",1226,null,127,123,"OBC","Hindu",null,"GOVT. SENIOR SECONDARY SCHOOL",8210302,"XXXX8749","YIMYIAW",77426475934,"xyz  ajmer ,rajasthan 3333694",36000,"N","N","No",18,"None",0]
[12,"A",492,"2018-07-09","SUMAN DEVI MEGHWANSHI",null,"GANGARAM MEGHWANSHI","LALI DEVI","F","2008-10-01",1227,null,127,125,"SC","Hindu",null,"GOVT. SENIOR SECONDARY SCHOOL",8210302,"XXXX1705","VGZZVWT",77426475935,"xyz  ajmer ,rajasthan 3333695",60000,"N","N","No",18,"None",3]
[12,"A",843,"2023-07-18","SURESH JAT",null,"PRAHLAD JAT","INDRA DEVI","M","2006-07-02",1228,null,127,122,"OBC","Hindu",null,"GOVT. SENIOR SECONDARY SCHOOL",8210302,"XXXX5219","YGSFIFC",77426475936,"xyz  ajmer ,rajasthan 3333696",48000,"N","N","No",20,"None",0]
[12,"A",857,"2023-08-02","Vishram Choudhary",null,"Shyoji Choudhary","Manfool Devi","M","2008-06-08",1229,null,127,123,"OBC","Hindu",null,"GOVT. SENIOR SECONDARY SCHOOL",8210302,null,null,77426475937,"xyz  ajmer ,rajasthan 3333697",60000,"N","N","No",18,"None",0]

{"sheet":"ELIGIBLE GIRLS","index":2,"n_rows":127,"n_cols":31,"rows_kept":127,"merged":[[0,0,0,10]]}
["मुख्यमंत्री लाडो प्रोत्साहन योजना की पात्र बालिकाओ की सूची "]
["S.NO",{"$f":"Student_Record!A1:AD1","v":"Class"},"Section","SRNO","DOA","Name","Late Status","FatherName","MotherName","Gender","Dob","ClassRollNo","ExamRollNumber","School Total Working Days","Student Total Attendence","Category","Religion","Previous Year Marks","Name Of School","School UDise Code","Aadhar No of Student","Bhamashash Card","Mobile No Student(Father/Mother/Guardian","Student Permanent Address","Annual Parental Income","CWSN Status","BPL Status","Minority Status","Age On Present(In Years)","Co-Curricular Activity","Distance From School"]
[{"$f":"IF(B3<>\"\",COUNTA($A$2:A2),\"\")","v":1},{"$f":"_xlfn.LET(\n  _xlpm.data, _xlfn._xlws.FILTER(Student_Record!A:AD, (Student_Record!J:J>=DATE(2016,6,1)) * (Student_Record!I:I=\"F\")),\n  IF(_xlpm.data=0, \"\", _xlpm.data)\n)","v":1},"A",973,"2025-10-03","Anisha Choudhary","","Prahlad Choudhary","Tina","F","2017-09-28","","",171,103,"OBC","","","GOVT. SENIOR SECONDARY SCHOOL",8210302,"","",77426475575,"xyz  ajmer ,rajasthan 3333335","","N","Y","",9,"",1]
[{"$f":"IF(B4<>\"\",COUNTA($A$2:A3),\"\")","v":2},1,"A",968,"2025-08-18","Anjali","","Sanwaraa","Samotra","F","2018-08-20","","",171,133,"OBC","Hindu","","GOVT. SENIOR SECONDARY SCHOOL",8210302,"","",77426475576,"xyz  ajmer ,rajasthan 3333336",55000,"N","N","No",8,"None",""]
[{"$f":"IF(B5<>\"\",COUNTA($A$2:A4),\"\")","v":3},1,"A",926,"2025-07-09","Arti Prajapat","","Mukesh Kumhar","Shrwani","F","2020-05-15","","",171,147,"OBC","Hindu","","GOVT. SENIOR SECONDARY SCHOOL",8210302,"","",77426475578,"xyz  ajmer ,rajasthan 3333338",48000,"N","N","No",6,"None",""]
[{"$f":"IF(B6<>\"\",COUNTA($A$2:A5),\"\")","v":4},1,"A",959,"2025-07-30","Dipika Prajapat","","Madan Lal Prajapat","Lali Devi","F","2019-03-20","","",171,143,"OBC","Hindu","","GOVT. SENIOR SECONDARY SCHOOL",8210302,"","",77426475579,"xyz  ajmer ,rajasthan 3333339",50000,"N","N","No",7,"None",1]
[{"$f":"IF(B7<>\"\",COUNTA($A$2:A6),\"\")","v":5},1,"A",941,"2025-07-16","Jyoti","","Mukesh","Maina","F","2019-04-15","","",171,143,"OBC","Hindu","","GOVT. SENIOR SECONDARY SCHOOL",8210302,"","",77426475580,"xyz  ajmer ,rajasthan 3333340",48000,"N","N","No",7,"None",1]
[{"$f":"IF(B8<>\"\",COUNTA($A$2:A7),\"\")","v":6},1,"A",924,"2025-07-01","Kismat Choudhary","","Jay Prakash Choudhary","Bharti","F","2019-05-01","","",171,150,"OBC","Hindu","","GOVT. SENIOR SECONDARY SCHOOL",8210302,"","",77426475581,"xyz  ajmer ,rajasthan 3333341",60000,"N","N","No",7,"None",1]
[{"$f":"IF(B9<>\"\",COUNTA($A$2:A8),\"\")","v":7},1,"A",971,"2025-10-03","Monika Choudhary","","Prahlad Jat","Tina","F","2019-08-15","","",171,106,"OBC","","","GOVT. SENIOR SECONDARY SCHOOL",8210302,"","",77426475582,"xyz  ajmer ,rajasthan 3333342","","N","Y","",7,"",1]
[{"$f":"IF(B10<>\"\",COUNTA($A$2:A9),\"\")","v":8},1,"A",937,"2025-07-14","Payal","","Pankaj Kumar","Kanchan","F","2019-08-14","","",171,144,"OBC","Hindu","","GOVT. SENIOR SECONDARY SCHOOL",8210302,"","",77426475584,"xyz  ajmer ,rajasthan 3333344",48000,"N","N","No",7,"None",1]
[{"$f":"IF(B11<>\"\",COUNTA($A$2:A10),\"\")","v":9},1,"A",962,"2025-08-14","Riya Nat","","Jitendra","Ishu Nat","F","2019-12-09","","",171,134,"SC","Hindu","","GOVT. SENIOR SECONDARY SCHOOL",8210302,"","",77426475585,"xyz  ajmer ,rajasthan 3333345",60000,"N","N","No",7,"None",""]
[{"$f":"IF(B12<>\"\",COUNTA($A$2:A11),\"\")","v":10},1,"A",934,"2025-07-14","Tannu Jat","","Sardar","Surgyan","F","2017-09-15","","",171,126,"OBC","Hindu","","GOVT. SENIOR SECONDARY SCHOOL",8210302,"","",77426475586,"xyz  ajmer ,rajasthan 3333346",48000,"N","N","No",9,"None",1]
[{"$f":"IF(B13<>\"\",COUNTA($A$2:A12),\"\")","v":11},2,"A",907,"2024-07-25","Aarushi","","Satyanarayan Jat","Ajodya","F","2019-04-19","","",171,149,"OBC","Hindu","","GOVT. SENIOR SECONDARY SCHOOL",8210302,"XXXX5052","",77426475587,"xyz  ajmer ,rajasthan 3333347","","N","N","No",7,"None",""]
[{"$f":"IF(B14<>\"\",COUNTA($A$2:A13),\"\")","v":12},2,"A",920,"2024-08-20","Anjali Meghwanshi","","Shankar","Gyarsi Meghwanshi","F","2019-03-21","","",171,145,"SC","Hindu","","GOVT. SENIOR SECONDARY SCHOOL",8210302,"XXXX0328","",77426475588,"xyz  ajmer ,rajasthan 3333348",60000,"N","N","No",7,"None",""]
[{"$f":"IF(B15<>\"\",COUNTA($A$2:A14),\"\")","v":13},2,"A",906,"2024-07-25","Annu Jat","","Ramswaroop","Bhagawati","F","2019-02-11","","",171,150,"OBC","Hindu","","GOVT. SENIOR SECONDARY SCHOOL",8210302,"XXXX6543","",77426475589,"xyz  ajmer ,rajasthan 3333349","","N","N","No",7,"None",""]
[{"$f":"IF(B16<>\"\",COUNTA($A$2:A15),\"\")","v":14},2,"A",901,"2024-07-19","Bhumika Sain","","Rajesh Sain","Lalita Sain","F","2019-03-28","","",171,144,"OBC","Hindu","","GOVT. SENIOR SECONDARY SCHOOL",8210302,"XXXX8084","",77426475590,"xyz  ajmer ,rajasthan 3333350","","N","N","No",7,"None",""]
[{"$f":"IF(B17<>\"\",COUNTA($A$2:A16),\"\")","v":15},2,"A",877,"2024-07-04","Khushi","","Mukesh","Shrwani","F","2018-05-19","","",171,143,"OBC","Hindu","","GOVT. SENIOR SECONDARY SCHOOL",8210302,"XXXX9543","",77426475593,"xyz  ajmer ,rajasthan 3333353",55000,"N","N","No",8,"None",""]
[{"$f":"IF(B18<>\"\",COUNTA($A$2:A17),\"\")","v":16},2,"A",922,"2024-09-02","Khushi Jat","","Parmeshwar","Shanti","F","2018-08-12","","",171,145,"OBC","Hindu","","GOVT. SENIOR SECONDARY SCHOOL",8210302,"XXXX6362","",77426475594,"xyz  ajmer ,rajasthan 3333354",50000,"N","N","No",8,"None",""]
[{"$f":"IF(B19<>\"\",COUNTA($A$2:A18),\"\")","v":17},2,"A",878,"2024-07-04","Mansha Jat","","Prem Chand Jat","Gamla Jat","F","2018-05-13","","",171,149,"OBC","Hindu","","GOVT. SENIOR SECONDARY SCHOOL",8210302,"XXXX9859","",77426475596,"xyz  ajmer ,rajasthan 3333356",60000,"N","N","No",8,"None",""]
[{"$f":"IF(B20<>\"\",COUNTA($A$2:A19),\"\")","v":18},2,"A",875,"2024-07-02","Mona","","Ramesh Chand","Gita Devi","F","2018-06-11","","",171,150,"SC","Hindu","","GOVT. SENIOR SECONDARY SCHOOL",8210302,"XXXX2685","",77426475597,"xyz  ajmer ,rajasthan 3333357",60000,"N","N","No",8,"None",""]
[{"$f":"IF(B21<>\"\",COUNTA($A$2:A20),\"\")","v":19},2,"A",884,"2024-07-06","Monika Prajapat","","Prakash","Parvati","F","2018-04-20","","",171,146,"OBC","Hindu","","GOVT. SENIOR SECONDARY SCHOOL",8210302,"XXXX8935","",77426475598,"xyz  ajmer ,rajasthan 3333358","","N","N","No",8,"None",""]
[{"$f":"IF(B22<>\"\",COUNTA($A$2:A21),\"\")","v":20},2,"A",879,"2024-07-05","Pooja Jat","","Shankar","Sharda Devi","F","2018-08-25","","",171,148,"OBC","Hindu","","GOVT. SENIOR SECONDARY SCHOOL",8210302,"XXXX5942","",77426475599,"xyz  ajmer ,rajasthan 3333359","","N","N","No",8,"None",""]
[{"$f":"IF(B23<>\"\",COUNTA($A$2:A22),\"\")","v":21},2,"A",880,"2024-07-05","Priya Jat","","Ganesh","Saroj Devi","F","2017-12-30","","",171,148,"OBC","Hindu","","GOVT. SENIOR SECONDARY SCHOOL",8210302,"XXXX5265","",77426475600,"xyz  ajmer ,rajasthan 3333360","","N","N","No",9,"None",""]
[{"$f":"IF(B24<>\"\",COUNTA($A$2:A23),\"\")","v":22},2,"A",881,"2024-07-06","Radhika","","Dhanraj","Mathra","F","2018-06-01","","",171,146,"OBC","Hindu","","GOVT. SENIOR SECONDARY SCHOOL",8210302,"XXXX5589","",77426475601,"xyz  ajmer ,rajasthan 3333361","","N","N","No",8,"None",""]
[{"$f":"IF(B25<>\"\",COUNTA($A$2:A24),\"\")","v":23},2,"A",905,"2024-07-19","Rinku Prajapat","","Kailash","Parvati","F","2018-11-15","","",171,148,"OBC","Hindu","","GOVT. SENIOR SECONDARY SCHOOL",8210302,"XXXX8744","",77426475603,"xyz  ajmer ,rajasthan 3333363","","N","N","No",8,"None",""]
[{"$f":"IF(B26<>\"\",COUNTA($A$2:A25),\"\")","v":24},2,"A",899,"2024-07-18","Shivangi","","Hanuman","Chaina","F","2017-03-23","","",171,147,"OBC","Hindu","","GOVT. SENIOR SECONDARY SCHOOL",8210302,"XXXX4862","",77426475604,"xyz  ajmer ,rajasthan 3333364","","N","N","No",9,"None",""]
[{"$f":"IF(B27<>\"\",COUNTA($A$2:A26),\"\")","v":25},2,"A",874,"2024-07-02","Shivani","","Prithvi Raj","Suman Devi","F","2018-10-20","","",171,146,"OBC","Hindu","","GOVT. SENIOR SECONDARY SCHOOL",8210302,"XXXX9004","",77426475605,"xyz  ajmer ,rajasthan 3333365",60000,"N","N","No",8,"None",""]
[{"$f":"IF(B28<>\"\",COUNTA($A$2:A27),\"\")","v":26},2,"A",882,"2024-07-06","Tannu","","Basram","Shila","F","2018-06-14","","",171,149,"OBC","Hindu","","GOVT. SENIOR SECONDARY SCHOOL",8210302,"XXXX8326","",77426475606,"xyz  ajmer ,rajasthan 3333366","","N","N","No",8,"None",""]
[{"$f":"IF(B29<>\"\",COUNTA($A$2:A28),\"\")","v":27},3,"A",853,"2023-07-21","Ashika","","Hariram","Lada Devi","F","2017-01-23","","",171,149,"OBC","Hindu","","GOVT. SENIOR SECONDARY SCHOOL",8210302,"XXXX1296","",77426475611,"xyz  ajmer ,rajasthan 3333371","","N","N","No",9,"None",""]
[{"$f":"IF(B30<>\"\",COUNTA($A$2:A29),\"\")","v":28},3,"A",893,"2024-07-15","Bhawana Choudhary","","Mahaveer Prasad Jat","Sita","F","2017-08-31","","",171,150,"OBC","Hindu","","GOVT. SENIOR SECONDARY SCHOOL",8210302,"XXXX5647","",77426475612,"xyz  ajmer ,rajasthan 3333372",50000,"N","N","No",9,"None",""]
[{"$f":"IF(B31<>\"\",COUNTA($A$2:A30),\"\")","v":29},3,"A",902,"2024-07-19","Hansa Prajapat","","Prakash Prajapat","Parvati","F","2016-08-21","","",171,150,"OBC","Hindu","","GOVT. SENIOR SECONDARY SCHOOL",8210302,"XXXX3911","",77426475615,"xyz  ajmer ,rajasthan 3333375",40000,"N","N","No",10,"None",""]
[{"$f":"IF(B32<>\"\",COUNTA($A$2:A31),\"\")","v":30},3,"A",844,"2023-07-18","Khushi","","Pardhan","Mamata","F","2017-01-16","","",171,150,"OBC","Hindu","","GOVT. SENIOR SECONDARY SCHOOL",8210302,"XXXX9153","",77426475616,"xyz  ajmer ,rajasthan 3333376","","N","N","No",9,"None",""]
[{"$f":"IF(B33<>\"\",COUNTA($A$2:A32),\"\")","v":31},3,"A",822,"2023-07-11","Kumkum","","Shankar","Sharda Devi","F","2017-05-25","","",171,149,"OBC","Hindu","","GOVT. SENIOR SECONDARY SCHOOL",8210302,"XXXX6428","",77426475618,"xyz  ajmer ,rajasthan 3333378","","N","N","No",9,"None",""]
[{"$f":"IF(B34<>\"\",COUNTA($A$2:A33),\"\")","v":32},3,"A",842,"2023-07-18","Mitali prajapat","","Shetan Prajapat","Ramkanya Devi","F","2017-11-07","","",171,149,"OBC","Hindu","","GOVT. SENIOR SECONDARY SCHOOL",8210302,"XXXX7768","",77426475619,"xyz  ajmer ,rajasthan 3333379","","N","N","No",9,"None",""]
[{"$f":"IF(B35<>\"\",COUNTA($A$2:A34),\"\")","v":33},3,"A",811,"2023-07-04","Nesu","","Ramswarup","Bhagawati Devi","F","2017-03-23","","",171,147,"OBC","Hindu","","GOVT. SENIOR SECONDARY SCHOOL",8210302,"XXXX1474","",77426475620,"xyz  ajmer ,rajasthan 3333380","","N","N","No",9,"None",""]
[{"$f":"IF(B36<>\"\",COUNTA($A$2:A35),\"\")","v":34},3,"A",813,"2023-07-05","Payal Bansali","","Chotu","Mamta Devi","F","2017-11-08","","",171,147,"SC","Hindu","","GOVT. SENIOR SECONDARY SCHOOL",8210302,"XXXX2253","",77426475621,"xyz  ajmer ,rajasthan 3333381","","N","N","No",9,"None",""]
[{"$f":"IF(B37<>\"\",COUNTA($A$2:A36),\"\")","v":35},3,"A",812,"2023-07-04","Priyanka Prajapat","","Haradayal","Sona Devi","F","2017-01-01","","",171,148,"OBC","Hindu","","GOVT. SENIOR SECONDARY SCHOOL",8210302,"XXXX3485","",77426475622,"xyz  ajmer ,rajasthan 3333382","","N","N","No",9,"None",""]
[{"$f":"IF(B38<>\"\",COUNTA($A$2:A37),\"\")","v":36},3,"A",894,"2024-07-15","Radhika Jat","","Hanuman Jat","Kamlesh","F","2016-08-03","","",171,148,"OBC","Hindu","","GOVT. SENIOR SECONDARY SCHOOL",8210302,"XXXX9145","",77426475623,"xyz  ajmer ,rajasthan 3333383",60000,"N","N","No",10,"None",""]
[{"$f":"IF(B39<>\"\",COUNTA($A$2:A38),\"\")","v":37},3,"A",839,"2023-07-15","Sonu Bheel","","Hanuman","Neraj","F","2016-06-16","","",171,136,"ST","Hindu","","GOVT. SENIOR SECONDARY SCHOOL",8210302,"XXXX0001","",77426475624,"xyz  ajmer ,rajasthan 3333384","","N","N","No",10,"None",1]
[{"$f":"IF(B40<>\"\",COUNTA($A$2:A39),\"\")","v":38},3,"A",831,"2023-07-13","Yartika Sain","","Rajesh Sain","Lalita Sain","F","2017-08-30","","",171,147,"OBC","Hindu","","GOVT. SENIOR SECONDARY SCHOOL",8210302,"XXXX6548","",77426475625,"xyz  ajmer ,rajasthan 3333385","","N","N","No",9,"None",""]
[{"$f":"IF(B41<>\"\",COUNTA($A$2:A40),\"\")","v":39},4,"A",762,"2022-07-05","Aamna","","Shahbuddin","Madina Bano","F","2017-01-03","","",171,146,"OBC","Hindu","","GOVT. SENIOR SECONDARY SCHOOL",8210302,"XXXX1402","",77426475626,"xyz  ajmer ,rajasthan 3333386",48000,"N","N","No",9,"None",""]
[{"$f":"IF(B42<>\"\",COUNTA($A$2:A41),\"\")","v":40},4,"A",769,"2022-07-12","Anjali","","Prithvi Raj","Suman Devi","F","2017-03-05","","",171,150,"OBC","Hindu","","GOVT. SENIOR SECONDARY SCHOOL",8210302,"XXXX8597","",77426475627,"xyz  ajmer ,rajasthan 3333387",48000,"N","N","No",9,"None",""]
[{"$f":"IF(B43<>\"\",COUNTA($A$2:A42),\"\")","v":41},4,"A",803,"2022-08-17","Anju","","Hansraj","Kali","F","2017-01-23","","",171,148,"OBC","Hindu","","GOVT. SENIOR SECONDARY SCHOOL",8210302,"XXXX9019","",77426475628,"xyz  ajmer ,rajasthan 3333388",50000,"N","N","No",9,"None",""]
[{"$f":"IF(B44<>\"\",COUNTA($A$2:A43),\"\")","v":42},4,"A",809,"2022-12-12","Anju","","Mahendra","Kopan","F","2016-06-22","","",171,146,"OBC","Hindu","","GOVT. SENIOR SECONDARY SCHOOL",8210302,"XXXX0096","",77426475629,"xyz  ajmer ,rajasthan 3333389",48000,"N","N","No",10,"None",2]
[{"$f":"IF(B45<>\"\",COUNTA($A$2:A44),\"\")","v":43},4,"A",770,"2022-07-12","Deepika Jat","","Prem Chand Jat","Gamla Jat","F","2016-11-17","","",171,149,"OBC","Hindu","","GOVT. SENIOR SECONDARY SCHOOL",8210302,"XXXX0466","",77426475631,"xyz  ajmer ,rajasthan 3333391","","N","N","No",10,"None",""]
[{"$f":"IF(B46<>\"\",COUNTA($A$2:A45),\"\")","v":44},4,"A",787,"2022-07-22","Khusi Prajapat","","Kailash","Parvati","F","2016-09-13","","",171,147,"OBC","Hindu","","GOVT. SENIOR SECONDARY SCHOOL",8210302,"XXXX5841","",77426475636,"xyz  ajmer ,rajasthan 3333396",48000,"N","N","No",10,"None",""]
[{"$f":"IF(B47<>\"\",COUNTA($A$2:A46),\"\")","v":45},4,"A",872,"2023-10-27","Monika","","Kanaram","Norati Devi","F","2017-04-02","","",171,149,"OBC","Hindu","","GOVT. SENIOR SECONDARY SCHOOL",8210302,"XXXX6276","",77426475637,"xyz  ajmer ,rajasthan 3333397",48000,"N","N","No",9,"None",""]
[{"$f":"IF(B48<>\"\",COUNTA($A$2:A47),\"\")","v":46},4,"A",925,"2025-07-09","Rinu","","Basram","Sheela","F","2017-01-03","","",171,149,"OBC","Hindu","","GOVT. SENIOR SECONDARY SCHOOL",8210302,"","",77426475641,"xyz  ajmer ,rajasthan 3333401",48000,"N","N","No",9,"None",1]
[{"$f":"IF(B49<>\"\",COUNTA($A$2:A48),\"\")","v":47},4,"A",760,"2022-07-05","Tannu","","Sonu","Gaytri","F","2016-11-28","","",171,146,"SC","Hindu","","GOVT. SENIOR SECONDARY SCHOOL",8210302,"XXXX5231","",77426475643,"xyz  ajmer ,rajasthan 3333403",50000,"N","N","No",10,"None",""]
[{"$f":"IF(B50<>\"\",COUNTA($A$2:A49),\"\")","v":48},5,"A",677,"2021-06-22","Astha Jat","","Ganesh Jat","Saroj Devi","F","2016-07-17","","",147,89,"OBC","Hindu","","GOVT. SENIOR SECONDARY SCHOOL",8210302,"XXXX8917","",77426475648,"xyz  ajmer ,rajasthan 3333408",60000,"N","N","No",10,"None",""]
[{"$f":"IF(B51<>\"\",COUNTA($A$2:A50),\"\")","v":""}]
[{"$f":"IF(B52<>\"\",COUNTA($A$2:A51),\"\")","v":""}]
[{"$f":"IF(B53<>\"\",COUNTA($A$2:A52),\"\")","v":""}]
[{"$f":"IF(B54<>\"\",COUNTA($A$2:A53),\"\")","v":""}]
[{"$f":"IF(B55<>\"\",COUNTA($A$2:A54),\"\")","v":""}]
[{"$f":"IF(B56<>\"\",COUNTA($A$2:A55),\"\")","v":""}]
[{"$f":"IF(B57<>\"\",COUNTA($A$2:A56),\"\")","v":""}]
[{"$f":"IF(B58<>\"\",COUNTA($A$2:A57),\"\")","v":""}]
[{"$f":"IF(B59<>\"\",COUNTA($A$2:A58),\"\")","v":""}]
[{"$f":"IF(B60<>\"\",COUNTA($A$2:A59),\"\")","v":""}]
[{"$f":"IF(B61<>\"\",COUNTA($A$2:A60),\"\")","v":""}]
[{"$f":"IF(B62<>\"\",COUNTA($A$2:A61),\"\")","v":""}]
[{"$f":"IF(B63<>\"\",COUNTA($A$2:A62),\"\")","v":""}]
[{"$f":"IF(B64<>\"\",COUNTA($A$2:A63),\"\")","v":""}]
[{"$f":"IF(B65<>\"\",COUNTA($A$2:A64),\"\")","v":""}]
[{"$f":"IF(B66<>\"\",COUNTA($A$2:A65),\"\")","v":""}]
[{"$f":"IF(B67<>\"\",COUNTA($A$2:A66),\"\")","v":""}]
[{"$f":"IF(B68<>\"\",COUNTA($A$2:A67),\"\")","v":""}]
[{"$f":"IF(B69<>\"\",COUNTA($A$2:A68),\"\")","v":""}]
[{"$f":"IF(B70<>\"\",COUNTA($A$2:A69),\"\")","v":""}]
[{"$f":"IF(B71<>\"\",COUNTA($A$2:A70),\"\")","v":""}]
[{"$f":"IF(B72<>\"\",COUNTA($A$2:A71),\"\")","v":""}]
[{"$f":"IF(B73<>\"\",COUNTA($A$2:A72),\"\")","v":""}]
[{"$f":"IF(B74<>\"\",COUNTA($A$2:A73),\"\")","v":""}]
[{"$f":"IF(B75<>\"\",COUNTA($A$2:A74),\"\")","v":""}]
[{"$f":"IF(B76<>\"\",COUNTA($A$2:A75),\"\")","v":""}]
[{"$f":"IF(B77<>\"\",COUNTA($A$2:A76),\"\")","v":""}]
[{"$f":"IF(B78<>\"\",COUNTA($A$2:A77),\"\")","v":""}]
[{"$f":"IF(B79<>\"\",COUNTA($A$2:A78),\"\")","v":""}]
[{"$f":"IF(B80<>\"\",COUNTA($A$2:A79),\"\")","v":""}]
[{"$f":"IF(B81<>\"\",COUNTA($A$2:A80),\"\")","v":""}]
[{"$f":"IF(B82<>\"\",COUNTA($A$2:A81),\"\")","v":""}]
[{"$f":"IF(B83<>\"\",COUNTA($A$2:A82),\"\")","v":""}]
[{"$f":"IF(B84<>\"\",COUNTA($A$2:A83),\"\")","v":""}]
[{"$f":"IF(B85<>\"\",COUNTA($A$2:A84),\"\")","v":""}]
[{"$f":"IF(B86<>\"\",COUNTA($A$2:A85),\"\")","v":""}]
[{"$f":"IF(B87<>\"\",COUNTA($A$2:A86),\"\")","v":""}]
[{"$f":"IF(B88<>\"\",COUNTA($A$2:A87),\"\")","v":""}]
[{"$f":"IF(B89<>\"\",COUNTA($A$2:A88),\"\")","v":""}]
[{"$f":"IF(B90<>\"\",COUNTA($A$2:A89),\"\")","v":""}]
[{"$f":"IF(B91<>\"\",COUNTA($A$2:A90),\"\")","v":""}]
[{"$f":"IF(B92<>\"\",COUNTA($A$2:A91),\"\")","v":""}]
[{"$f":"IF(B93<>\"\",COUNTA($A$2:A92),\"\")","v":""}]
[{"$f":"IF(B94<>\"\",COUNTA($A$2:A93),\"\")","v":""}]
[{"$f":"IF(B95<>\"\",COUNTA($A$2:A94),\"\")","v":""}]
[{"$f":"IF(B96<>\"\",COUNTA($A$2:A95),\"\")","v":""}]
[{"$f":"IF(B97<>\"\",COUNTA($A$2:A96),\"\")","v":""}]
[{"$f":"IF(B98<>\"\",COUNTA($A$2:A97),\"\")","v":""}]
[{"$f":"IF(B99<>\"\",COUNTA($A$2:A98),\"\")","v":""}]
[{"$f":"IF(B100<>\"\",COUNTA($A$2:A99),\"\")","v":""}]
[{"$f":"IF(B101<>\"\",COUNTA($A$2:A100),\"\")","v":""}]
[{"$f":"IF(B102<>\"\",COUNTA($A$2:A101),\"\")","v":""}]
[{"$f":"IF(B103<>\"\",COUNTA($A$2:A102),\"\")","v":""}]
[{"$f":"IF(B104<>\"\",COUNTA($A$2:A103),\"\")","v":""}]
[{"$f":"IF(B105<>\"\",COUNTA($A$2:A104),\"\")","v":""}]
[{"$f":"IF(B106<>\"\",COUNTA($A$2:A105),\"\")","v":""}]
[{"$f":"IF(B107<>\"\",COUNTA($A$2:A106),\"\")","v":""}]
[{"$f":"IF(B108<>\"\",COUNTA($A$2:A107),\"\")","v":""}]
[{"$f":"IF(B109<>\"\",COUNTA($A$2:A108),\"\")","v":""}]
[{"$f":"IF(B110<>\"\",COUNTA($A$2:A109),\"\")","v":""}]
[{"$f":"IF(B111<>\"\",COUNTA($A$2:A110),\"\")","v":""}]
[{"$f":"IF(B112<>\"\",COUNTA($A$2:A111),\"\")","v":""}]
[{"$f":"IF(B113<>\"\",COUNTA($A$2:A112),\"\")","v":""}]
[{"$f":"IF(B114<>\"\",COUNTA($A$2:A113),\"\")","v":""}]
[{"$f":"IF(B115<>\"\",COUNTA($A$2:A114),\"\")","v":""}]
[{"$f":"IF(B116<>\"\",COUNTA($A$2:A115),\"\")","v":""}]
[{"$f":"IF(B117<>\"\",COUNTA($A$2:A116),\"\")","v":""}]
[{"$f":"IF(B118<>\"\",COUNTA($A$2:A117),\"\")","v":""}]
[{"$f":"IF(B119<>\"\",COUNTA($A$2:A118),\"\")","v":""}]
[{"$f":"IF(B120<>\"\",COUNTA($A$2:A119),\"\")","v":""}]
[{"$f":"IF(B121<>\"\",COUNTA($A$2:A120),\"\")","v":""}]
[{"$f":"IF(B122<>\"\",COUNTA($A$2:A121),\"\")","v":""}]
[{"$f":"IF(B123<>\"\",COUNTA($A$2:A122),\"\")","v":""}]
[{"$f":"IF(B124<>\"\",COUNTA($A$2:A123),\"\")","v":""}]
[{"$f":"IF(B125<>\"\",COUNTA($A$2:A124),\"\")","v":""}]
[{"$f":"IF(B126<>\"\",COUNTA($A$2:A125),\"\")","v":""}]
[{"$f":"IF(B127<>\"\",COUNTA($A$2:A126),\"\")","v":""}]

{"sheet":"form","index":3,"n_rows":61,"n_cols":7,"rows_kept":61,"merged":[[0,0,0,4],[0,6,1,8],[1,0,1,4],[2,6,3,8],[3,1,3,3],[3,4,3,5],[4,1,4,3],[5,10,5,12],[6,1,6,3],[6,4,6,5],[6,10,7,13],[7,1,7,3],[7,4,7,5],[8,1,8,3],[8,4,8,5],[8,6,9,8],[9,1,9,3],[9,4,9,5],[10,1,10,3],[10,4,10,5],[10,6,11,9],[11,1,11,3],[11,4,11,5],[12,1,12,3],[12,4,12,5],[13,1,13,3],[13,4,13,5],[14,1,14,3],[14,4,14,5],[15,1,15,3],[15,4,15,5],[16,1,16,3],[16,4,16,5],[17,1,17,3],[17,4,17,5],[18,1,18,3],[18,4,18,5],[19,1,19,3],[19,4,19,5],[20,1,20,3],[20,4,20,5],[21,1,21,3],[21,4,21,5],[23,1,23,5],[24,1,24,4],[25,1,25,4],[26,1,26,4],[27,1,27,4],[28,1,28,4],[29,1,29,4],[33,2,33,3],[37,0,37,5],[38,2,38,5],[39,0,49,5],[50,0,50,5],[53,0,53,5],[54,0,54,1],[54,2,54,3],[55,0,55,5],[56,0,56,3],[57,0,57,5],[60,0,60,5]]}
["शिक्षा विभाग ,राजस्थान सरकार ",{"$nulls":5},"प्रिन्ट करने ले लिए SR.NO या लिस्ट नंबर लिखे "]
["लाडो प्रोत्साहन योजना के लिए आवेदन पत्र वर्ष -",{"$nulls":4},"2026-27"]
[{"$nulls":6},3]
[null,"छात्रा की छात्रवृत्ति यूनिक आई. डी .........................."]
[null,"(पूर्ति संस्था प्रधान द्वारा शालादर्पण पोर्टल से की जाएगी )"]
[]
[1,"विद्यालय का नाम ",null,null,{"$f":"IFERROR(\n   INDEX('ELIGIBLE GIRLS'!S:S, MATCH(G3, 'ELIGIBLE GIRLS'!A:A, 0)),\n   IFERROR(\n      INDEX('ELIGIBLE GIRLS'!S:S, MATCH(G3, 'ELIGIBLE GIRLS'!D:D, 0)),\n      \"\"\n   )\n)","v":"GOVT. SENIOR SECONDARY SCHOOL"}]
[2,"छात्रा का नाम ",null,null,{"$f":"IFERROR(\n   INDEX('ELIGIBLE GIRLS'!F:F, MATCH(G3, 'ELIGIBLE GIRLS'!A:A, 0)),\n   IFERROR(\n      INDEX('ELIGIBLE GIRLS'!F:F, MATCH(G3, 'ELIGIBLE GIRLS'!D:D, 0)),\n      \"\"\n   )\n)","v":"Arti Prajapat"}]
[3,"छात्रा की माता का नाम ",null,null,{"$f":"IFERROR(\n   INDEX('ELIGIBLE GIRLS'!I:I, MATCH(G3, 'ELIGIBLE GIRLS'!A:A, 0)),\n   IFERROR(\n      INDEX('ELIGIBLE GIRLS'!I:I, MATCH(G3, 'ELIGIBLE GIRLS'!D:D, 0)),\n      \"\"\n   )\n)","v":"Shrwani"}]
[4,"छात्रा के पिता का नाम ",null,null,{"$f":"IFERROR(\n   INDEX('ELIGIBLE GIRLS'!H:H, MATCH(G3, 'ELIGIBLE GIRLS'!A:A, 0)),\n   IFERROR(\n      INDEX('ELIGIBLE GIRLS'!H:H, MATCH(G3, 'ELIGIBLE GIRLS'!D:D, 0)),\n      \"\"\n   )\n)","v":"Mukesh Kumhar"}]
[5,"संरक्षक का नाम (माता पिता के जीवित ना होने की स्थिति में )"]
[6,"माता-पिता के जीवित ना होने की स्थिति में माता-पिता का \nमृत्यु प्रमाण पत्र जारी करने की दिनांक व क्रमांक "]
[7,"छात्रा की जन्मतिथि (अंकों एंव शब्दों में )",null,null,{"$f":"IFERROR(\n   INDEX('ELIGIBLE GIRLS'!K:K, MATCH(G3, 'ELIGIBLE GIRLS'!A:A, 0)),\n   IFERROR(\n      INDEX('ELIGIBLE GIRLS'!K:K, MATCH(G3, 'ELIGIBLE GIRLS'!D:D, 0)),\n      \"\"\n   )\n)","v":"2020-05-15"}]
[8,"कक्षा एंव सेक्शन जिसमे अध्ययनरत है ",null,null,{"$f":"IFERROR(\n   INDEX('ELIGIBLE GIRLS'!B:B, MATCH(G3, 'ELIGIBLE GIRLS'!A:A, 0)) & \"   \" &\n   INDEX('ELIGIBLE GIRLS'!C:C, MATCH(G3, 'ELIGIBLE GIRLS'!A:A, 0)),\n   IFERROR(\n      INDEX('ELIGIBLE GIRLS'!B:B, MATCH(G3, 'ELIGIBLE GIRLS'!D:D, 0)) & \"   \" &\n      INDEX('ELIGIBLE GIRLS'!C:C, MATCH(G3, 'ELIGIBLE GIRLS'!D:D, 0)),\n      \"\"\n   )\n)","v":"1   A"}]
[9,"छात्रा का विद्यालय में प्रवेश दिनांक एंव एस. आर नंबर ",null,null,{"$f":"IFERROR(\n   TEXT(INDEX('ELIGIBLE GIRLS'!E:E, MATCH(G3, 'ELIGIBLE GIRLS'!A:A, 0)), \"dd-mm-yyyy\") & \" / \" &\n   INDEX('ELIGIBLE GIRLS'!D:D, MATCH(G3, 'ELIGIBLE GIRLS'!A:A, 0)),\n   IFERROR(\n      TEXT(INDEX('ELIGIBLE GIRLS'!E:E, MATCH(G3, 'ELIGIBLE GIRLS'!D:D, 0)), \"dd-mm-yyyy\") & \" / \" &\n      INDEX('ELIGIBLE GIRLS'!D:D, MATCH(G3, 'ELIGIBLE GIRLS'!D:D, 0)),\n      \"\"\n   )\n)","v":"09-07-2025 / 926"}]
[10,"गत कक्षा के विद्यालय का नाम व पता (तृतीय किश्त के\n अलावा उतरवर्ती किश्तों के लिए )"]
[11,"अभिभावक /संरक्षक के मोबाईल नंबर ",null,null,{"$f":"IFERROR(\n   INDEX('ELIGIBLE GIRLS'!W:W, MATCH(G3, 'ELIGIBLE GIRLS'!A:A, 0)),\n   IFERROR(INDEX('ELIGIBLE GIRLS'!W:W, MATCH(G3, 'ELIGIBLE GIRLS'!D:D, 0)), \"\")\n)","v":77426475578}]
[12,"जाति वर्ग (अजा/अजजा/अन्य पिछड़ा वर्ग/सामान्य/\nअल्पसंख्यक/एमबीसी)",null,null,{"$f":"IFERROR(\n   INDEX('ELIGIBLE GIRLS'!P:P, MATCH(G3, 'ELIGIBLE GIRLS'!A:A, 0)),\n   IFERROR(INDEX('ELIGIBLE GIRLS'!P:P, MATCH(G3, 'ELIGIBLE GIRLS'!D:D, 0)), \"\")\n)","v":"OBC"}]
[13,"धर्म ",null,null,{"$f":"IFERROR(\n   INDEX('ELIGIBLE GIRLS'!Q:Q, MATCH(G3, 'ELIGIBLE GIRLS'!A:A, 0)),\n   IFERROR(INDEX('ELIGIBLE GIRLS'!Q:Q, MATCH(G3, 'ELIGIBLE GIRLS'!D:D, 0)), \"\")\n)","v":"Hindu"}]
[14,"छात्रा का आधार नंबर/एनरोलमेंट नंबर "]
[15,"जन आधार नंबर /एनरोलमेंट नंबर"]
[16,"स्थाई पता ",null,null,{"$f":"IFERROR(\n   INDEX('ELIGIBLE GIRLS'!X:X, MATCH(G3, 'ELIGIBLE GIRLS'!A:A, 0)),\n   IFERROR(INDEX('ELIGIBLE GIRLS'!X:X, MATCH(G3, 'ELIGIBLE GIRLS'!D:D, 0)), \"\")\n)","v":"xyz  ajmer ,rajasthan 3333338"}]
[]
[null,"नोट :- वांछित दस्तावेज संलग्न करते हुए सामने के कॉलम में ☑ का निशान अंकित करे "]
[]
["क्रम\nसंख्या ","योजना के विस्तृत दिशानिर्देशों के अनुसार संलग्न किए जाने वाले दस्तावेज़ ",{"$nulls":3},"संलग्न कर ✓करे "]
[1,"PREGNANCY CHILD TRACKING AND HEALTH SERVICE\nMANAGEMENT SYSTEM ID (PCTS ID/CARD)",{"$nulls":3},{"$f":"IF(E8<>\"\",\"☑\",\"☐\")","v":"☑"}]
[2,"दो  संतानो सम्बन्धि स्वघोषणा प्रमाण पत्र (अभिभावक /संरक्षक द्वारा)",{"$nulls":3},{"$f":"IF(E9<>\"\",\"☑\",\"☐\")","v":"☑"}]
[3,"जन्म प्रमाण पत्र,जन आधार कार्ड एंव आधार कार्ड (अभिभावक /संरक्षक द्वारा प्रमाणित)",{"$nulls":3},{"$f":"IF(E10<>\"\",\"☑\",\"☐\")","v":"☑"}]
[3,"माता-पिता के जीवित ना होने की स्थिति में माता-पिता के मृत्यु \nप्रमाण पत्र की संरक्षक के द्वारा प्रमाणित प्रति ",{"$nulls":3},{"$f":"IF(E12<>\"\",\"☑\",\"☐\")","v":"☐"}]
[]
[]
[]
[null,"अभिभावक/संरक्षक के हस्ताक्षर ","जांचकर्ता /कक्षा अध्यापक ",null,null,"संस्था प्रधान के हस्ताक्षर मय मोहर "]
[]
[]
[]
["माता-पिता/सरंक्षक द्वारा घोषणा "]
["मैं ",{"$f":"E10","v":"Mukesh Kumhar"},"  (माता-पिता/संरक्षक) घोषणा करता/करती हूँ की मैने योजना संबंधी सभी नियमों"]
["/निर्देशों की भली भांति अध्ययन कर लिया है। छात्रा के मूल दस्तावेज में जन-आधार कार्ड, सही है। विद्यार्थी का बैंक खाता उसके आधार से सीडेड तथा जन-आधार कार्ड से लिंक है। मेरे द्वारा प्रस्तुत उपरोक्त विवरण, संलग्न दस्तावेज, इस घोषणा में अंकित सूचनाएं गलत पाये जानें की स्थिति में यदि लाडो प्रोत्साहन योजना कि तृतीय किश्त कि राशि प्राप्त नहीं होती है तो इसका समस्त दायित्व मेरा स्वयं का होगा। भविष्य में किसी भी प्रकार की जांच प्रक्रिया में मेरे द्वारा प्रस्तुत सूचनाएं अथवा दस्तावेज गलत पाए जाने की स्थिति में मेरे विरूद्ध पुलिस/वैधानिक कार्यवाही की जा सकेगी तथा मैं प्राप्त छात्रवृत्ति वापिस जमा करवाने का वचन देता/देती हूँ।"]
{"$rows_empty":10}
["  दिनांक :                       हस्ताक्षर जांचकर्ता /कक्षाध्यापक                                माता-पिता/संरक्षक के हस्ताक्षर"]
[]
[]
["संस्था प्रधान/ लाडो प्रोत्साहन योजना प्रभारी द्वारा प्रमाणीकरण "]
["प्रमाणित किया जाता है कि छात्रा",null,{"$f":"E8","v":"Arti Prajapat"},null,"पुत्री",{"$f":"E10","v":"Mukesh Kumhar"}]
[" के लाडो प्रोत्साहन योजना के आवेदन की जांच कर ली गई है। आवेदन पत्र के साथ समस्त वांछित संलग्नक लगे हुए हैं। छात्रा द्वारा प्रस्तुत जन-आधार कार्ड, Pregnancy-child Tracking and Health Service Management System ID (PCTS ID/Card) एवं दो संतानों सबंधी स्वघोषणा प्रमाण-पत्र (स्वप्रमाणित प्रति) को शालादर्पण "]
["पोर्टल पर अपडेट कर लिया गया है। अतः छात्रा को सत्र ",{"$nulls":3},{"$f":"form!F2","v":"2026-27"},"की लाडो प्रोत्साहन योजना "]
["कि तृतीय किश्त की राशि लाडो प्रोत्साहन योजना प्रभारी द्वारा स्वीकृत की जाती है। "]
[]
[]
["                                                                                                     संस्था प्रधान/लाडो प्रोत्साहन योजना प्रभारी के हस्ताक्षर \n                                                                                                              मय मोहर"]